program: Gaussian 09
title: 000170050
version: EM64L-G09RevD.01
frameworkgroup: C1[X(C24H32O3)]
method: RPBEPBE
basis: SDD
operation: Freq
keyword: #pfreq=noraman
keyword: PBEPBE/SDD
title: #p freq=noraman PBEPBE/SDD
converged: YES YES NO NO
title: Mulliken charges:
elementType: O O O C C C C C C C C C C C C C C C C C C C C C C C C H H H H H H H H H H H H H H H H H H H H H H H H H H H H H H H H
charge: -0.254052 -0.317773 -0.246964 -0.360688 -0.375790 -0.348231 -0.335096 -0.403949 -0.571007 -0.354840 -0.358824 0.514755 -0.317935 -0.693590 -0.694251 -0.384011 -0.417606 -0.418084 -0.324707 0.377295 0.359510 0.218177 -0.375710 -0.332498 -0.319625 -0.335458 0.140299 0.188840 0.188313 0.208625 0.204786 0.191377 0.191153 0.186167 0.188711 0.216496 0.216189 0.207158 0.203837 0.195206 0.194885 0.196010 0.197897 0.210952 0.210849 0.210772 0.210919 0.217229 0.209370 0.216246 0.210153 0.234407 0.233673 0.246179 0.302480 0.256241 0.251076 0.270276 0.264184
chargesum: 0.00000
title: Mulliken charges with hydrogens summed into heavy atoms:
elementType: O O O C C C C C C C C C C C C C C C C C C C C C C C C
charge: -0.254052 -0.317773 -0.246964 0.016465 0.037621 0.034298 0.039782 0.028735 -0.160013 0.035250 0.035084 0.514755 0.103866 -0.054670 -0.058481 -0.149604 -0.183933 -0.171905 -0.022227 0.377295 0.359510 0.218177 -0.119469 -0.081421 -0.049349 -0.071274 0.140299
polarizability: 4.87627992e+02 -3.54359486e+00 2.52715036e+02 -1.30939915e+01 2.08318506e+01 1.68578933e+02
1716.lowfreq: -0.0016 -0.0012 0.0016 1.0039 1.7916 7.0778 14.2815 14.9769 21.4518
frequency: 13.8362 14.6431 21.4354 25.4875 28.2975 42.1811 49.7175 53.6890 61.3898 63.9164 77.2307 93.8686 109.5631 115.4450 119.0032 129.3467 134.6462 142.4848 155.0264 162.9978 195.7345 204.3398 222.9139 228.5416 255.2572 274.9347 297.8346 309.6751 320.4624 362.4746 368.0825 396.0992 410.3896 413.4248 416.5281 441.6021 476.5412 495.5397 505.2513 525.6725 566.5385 624.2059 626.8649 647.6869 667.9544 721.8872 726.3979 727.1199 745.8716 751.6737 753.3741 754.7232 776.6370 804.7080 808.7977 826.7160 830.0681 835.4534 837.3566 854.0738 855.5240 890.1198 892.3542 895.8679 952.9776 956.3914 961.0298 971.8715 980.5199 989.9412 991.0023 996.2798 999.7946 1008.1761 1013.0956 1032.0442 1045.0695 1049.2542 1069.0140 1072.8052 1076.6760 1087.0656 1110.2082 1118.5605 1124.6802 1127.0850 1148.5427 1152.3922 1173.1355 1196.4090 1196.6113 1197.4504 1217.8325 1231.9360 1240.3341 1241.6326 1245.8532 1247.4984 1254.3644 1280.9979 1284.5851 1288.4558 1291.1355 1293.9452 1296.7570 1299.7920 1300.9083 1305.7441 1336.9461 1342.7210 1352.3372 1358.5394 1374.2327 1379.0032 1387.3342 1387.9543 1390.7601 1411.3325 1431.0789 1464.5265 1464.9889 1466.3879 1467.0203 1471.2889 1474.0458 1475.7827 1477.2312 1477.5175 1483.1341 1484.7453 1489.2580 1489.6817 1490.0668 1497.6791 1569.6769 1582.8320 1616.1188 1619.4122 1622.5214 2951.2114 2952.0141 2955.3227 2959.3429 2965.3056 2969.1727 2970.2561 2971.8536 2973.5912 2978.4804 2991.6875 2991.7114 2995.2849 3006.9389 3011.6399 3011.9909 3026.6428 3033.2012 3047.2120 3063.8407 3068.3981 3070.1253 3071.2660 3073.0861 3123.4107 3126.7824 3153.4322 3159.1630 3162.8638 3173.8001 3182.5055 3210.4825
redmass: 4.3575 3.9812 4.9186 3.2954 4.4279 2.3535 2.6556 1.6778 4.3256 4.0680 5.4877 2.3754 3.8692 1.6999 3.0999 2.0826 3.5609 3.2976 2.8813 3.5992 5.5279 4.5041 1.1316 1.1230 4.2729 3.8719 6.4754 4.9951 4.4991 3.6881 3.4356 3.5548 2.9786 3.9484 2.9873 3.6247 5.1445 3.9429 2.9923 3.2715 3.9493 6.8973 7.0149 6.9598 4.3379 4.2180 1.0672 1.0688 4.4333 1.1080 4.2326 1.1866 6.5392 1.1733 4.7023 1.2823 4.0653 1.4012 1.3842 1.5095 1.6002 1.8741 1.1924 1.8663 1.2294 1.3767 7.8527 1.3642 1.3602 1.2202 1.2506 3.8980 3.5622 2.9631 3.7625 3.5119 3.2010 3.0965 1.3363 2.6776 2.3458 2.1142 2.3205 1.3280 1.2452 2.6761 1.4444 2.2628 1.2359 1.4240 1.5234 1.5611 2.7826 2.9939 1.3489 1.2927 4.3843 1.2967 1.2981 1.0862 1.0861 1.1164 1.1239 1.0910 1.3212 1.3769 1.2910 1.2935 1.4478 1.4340 1.6298 1.6186 2.7029 5.1885 2.0462 1.2152 1.2168 3.1269 4.3451 1.0725 1.0747 1.0793 1.0737 1.0944 1.0744 1.0432 1.0449 1.1055 1.0818 1.1421 1.6112 1.2043 1.3729 1.9787 7.9050 7.1143 6.5425 7.0700 9.4857 1.0558 1.0589 1.0582 1.0588 1.0592 1.0594 1.0556 1.0399 1.0362 1.0596 1.0980 1.0979 1.0592 1.1014 1.1065 1.1007 1.1034 1.1047 1.1046 1.1051 1.1008 1.1009 1.0992 1.0993 1.0897 1.0905 1.0883 1.0880 1.0953 1.0969 1.0962 1.0940
irintensity: 0.1477 0.0452 0.1371 0.6611 0.1134 0.0845 0.0051 0.0100 0.2668 0.1153 0.1310 0.0310 0.2951 0.6101 0.3119 0.0819 0.2208 0.4820 0.8342 4.0536 1.1858 2.2432 0.0013 0.0075 1.4483 0.7549 0.3361 11.0049 0.2913 1.1322 1.3440 0.7079 0.1222 2.6663 0.0528 0.2404 3.2727 0.4537 6.7543 16.8934 15.8900 7.5082 3.8001 36.5754 25.4022 0.6930 12.1661 9.3775 3.4767 0.8988 11.6800 0.4591 10.2443 8.1499 5.5658 1.6099 9.6334 2.2863 16.2012 6.4801 98.9813 7.7254 1.9332 1.3712 1.2108 1.7823 162.3717 0.8543 1.4177 0.4261 0.1104 100.7499 0.2923 12.1629 6.7236 329.2651 9.0627 22.9129 4.7650 15.0477 0.0226 8.3056 29.7163 14.3181 16.2165 12.0771 1.9217 556.2624 285.0800 114.0216 3.2774 10.4959 32.3586 103.8338 9.8568 10.1737 607.5560 0.8832 2.0006 0.0035 0.5496 1.0119 0.0650 1.0276 2.0786 1.1769 1.8777 4.2069 1.0306 1.0818 1.0570 0.0754 5.7153 8.1828 18.1470 10.0421 12.9252 13.6414 26.0973 0.2089 0.4368 1.1296 0.7219 18.4046 1.2034 12.1758 12.6278 9.2795 0.4624 29.4872 54.2115 21.7025 144.7777 71.8764 44.6420 4.5950 83.8265 124.0057 265.1323 13.5067 12.6100 13.1037 7.4458 5.6807 92.3967 32.2988 36.1417 41.4044 115.8944 2.0449 1.6108 38.5646 3.4920 18.2534 1.4908 7.4814 36.1240 64.5131 51.3536 95.3657 115.7059 54.2739 52.5757 18.1321 25.4836 0.7139 11.7086 6.7453 7.7719 5.7317 4.1313
temp: 298.150 k
press: 1.00000 atm
elementType: 8 8 8 6 6 6 6 6 6 6 6 6 6 6 6 6 6 6 6 6 6 6 6 6 6 6 6 1 1 1 1 1 1 1 1 1 1 1 1 1 1 1 1 1 1 1 1 1 1 1 1 1 1 1 1 1 1 1 1
symmnumber: 1
zpe: 1315985.0 jmol-1
zpe.correction: 0.501232 hartree
zpe.thermalcorrener: 0.530433 hartree
zpe.thermalcorrenthalpy: 0.531377 hartree
zpe.thermalcorrgfe: 0.435106 hartree
zpe.sumelectzpe: -1157.396381 hartree
zpe.sumelectthermal: -1157.367181 hartree
zpe.sumelectthermalent: -1157.366237 hartree
zpe.sumelectthermalfe: -1157.462508 hartree
dipole: -2.3502 -3.6463 -0.5968
dipole: 4.3789
quadrupole: -126.8204 -163.3344 -167.3280
quadrupole: 3.6247 -0.0056 2.2022
quadrupole: 25.6739 -10.8401 -14.8337 3.6247 -0.0056 2.2022
hfenergy: -1157.8976135 hartree
pointgroup: C01 [X(C24H32O3)]
dipole: -0.893836 -1.327841 0.6371146 debye
polarizability: 487.6328813|-6.7001335|244.5976937|-12.3770279|-32.178303|176.6913864 unknown
InChI: InChI=1S/C24H32O3/c1-3-5-7-9-19-26-22-17-13-21(14-18-22)24(25)27-23-15-11-20(12-16-23)10-8-6-4-2/h11-18H,3-10,19H2,1-2H3
charge 0 multiplicity 1
59 atoms
O  -5.093291 1.148572 -0.413612
O  1.260938 0.448702 -0.846971
O  1.072584 2.676468 -1.600515
C  -8.017818 -1.088761 0.596615
C  7.590962 -0.3733 0.40325
C  -9.538791 -0.835319 0.701893
C  9.099937 -0.702245 0.429101
C  -7.2333 0.164869 0.145487
C  6.940881 -0.625498 -0.98653
C  -10.335358 -2.088174 1.131576
C  9.750741 -0.458153 1.81007
C  5.452152 -0.314705 -1.002031
C  -5.729098 -0.098912 0.065075
C  -11.853246 -1.827634 1.240687
C  11.258162 -0.792482 1.831882
C  4.504944 -1.269907 -0.546456
C  4.966905 0.947159 -1.425099
C  3.129384 -0.972227 -0.512264
C  3.591547 1.273689 -1.400919
C  2.677496 0.298378 -0.93703
C  -3.707406 1.167127 -0.570633
C  -0.911271 1.422809 -0.957447
C  -3.164307 2.392778 -1.042097
C  -2.851029 0.067892 -0.29332
C  -1.782129 2.515692 -1.232756
C  -1.462929 0.203869 -0.487605
C  0.542314 1.620045 -1.178672
H  -7.835892 -1.918719 -0.117963
H  -7.638073 -1.434516 1.58103
H  7.433337 0.686068 0.689949
H  7.063938 -0.982576 1.165489
H  -9.725766 -0.016236 1.427053
H  -9.920208 -0.477069 -0.276912
H  9.250848 -1.762551 0.135465
H  9.624373 -0.091269 -0.335527
H  -7.591159 0.49763 -0.847627
H  -7.414906 0.999586 0.849198
H  7.466276 -0.006896 -1.740352
H  7.11201 -1.684024 -1.267101
H  -10.150648 -2.904652 0.403793
H  -9.950082 -2.448651 2.107409
H  9.224045 -1.066956 2.573073
H  9.600701 0.601396 2.100979
H  -5.50486 -0.92097 -0.646029
H  -5.315773 -0.363938 1.060276
H  -12.067623 -1.035294 1.982522
H  -12.270521 -1.499243 0.270094
H  -12.398481 -2.737533 1.551793
H  11.432068 -1.853295 1.569473
H  11.698961 -0.614305 2.829979
H  11.812226 -0.172296 1.10203
H  4.848854 -2.258678 -0.219255
H  5.677761 1.700125 -1.787157
H  2.39534 -1.706229 -0.165646
H  3.237641 2.250011 -1.73173
H  -3.846715 3.222483 -1.248083
H  -3.251789 -0.882395 0.069685
H  -1.347252 3.452452 -1.595757
H  -0.794907 -0.635095 -0.276326
