program: Gaussian 09
title: 000169970
version: EM64L-G09RevD.01
frameworkgroup: C1[X(C18H22N2OS)]
method: RPBEPBE
basis: SDD
operation: Freq
keyword: #p
keyword: freq=noraman
keyword: PBEPBE/SDD
title: #p freq=noraman PBEPBE/SDD
converged: YES YES NO NO
title: Mulliken charges:
elementType: S O N N C C C C C C C C C C C C C C C C C C H H H H H H H H H H H H H H H H H H H H H H
charge: 0.221353 -0.272415 -0.288048 -0.304539 -0.040560 -0.448802 -0.384137 0.563379 0.486690 -0.726249 -0.416469 -0.346156 -0.479807 -0.340871 -0.264673 -0.269430 0.342896 -0.397002 -0.238566 -0.254815 -0.628222 -0.535840 0.230036 0.213979 0.216693 0.192026 0.225630 0.258350 0.207337 0.196017 0.273364 0.249618 0.242520 0.243748 0.246220 0.245361 0.226687 0.230990 0.194934 0.219242 0.223673 0.220263 0.221526 0.244070
chargesum: 0.00000
title: Mulliken charges with hydrogens summed into heavy atoms:
elementType: S O N N C C C C C C C C C C C C C C C C C C
charge: 0.221353 -0.272415 -0.288048 -0.054921 0.189476 -0.018130 0.033519 0.563379 0.486690 -0.064544 -0.416469 -0.346156 -0.206443 -0.098351 -0.020925 -0.023210 0.342896 -0.151641 -0.011879 -0.023826 0.009628 0.150019
polarizability: 3.17327190e+02 -1.97288394e+01 1.89892047e+02 -1.27008693e+01 -2.69895358e+01 2.01257104e+02
1716.lowfreq: -8.1674 -5.4602 0.0008 0.0013 0.0015 6.9321 21.4803 30.8345 39.6300
frequency: 21.0289 30.6147 39.6117 52.7897 78.8401 86.7898 92.4544 113.1060 126.7149 137.7280 181.0204 199.9711 214.6825 221.4622 230.1123 235.7869 247.0348 273.9322 289.6586 313.3069 323.0814 349.3253 361.0472 381.6441 400.9908 425.4022 442.3699 443.6592 470.7447 485.4196 526.1678 544.4101 588.9967 603.3766 608.0699 642.0587 670.4452 688.2665 699.8463 714.2697 728.1681 752.0792 788.0781 805.8513 836.0344 846.3089 858.8082 889.6028 912.0358 919.4808 927.1934 940.4866 950.9763 969.5960 970.7096 1008.8141 1026.7914 1028.7020 1043.6264 1071.1901 1088.8246 1100.0540 1112.5232 1127.0629 1128.7090 1139.6461 1146.7712 1158.5328 1161.5226 1173.2658 1175.5360 1186.3636 1233.7261 1250.4308 1256.8903 1263.2389 1278.9219 1295.8414 1320.6802 1341.4083 1359.6021 1368.2011 1373.4590 1381.2513 1388.1109 1422.1772 1429.3179 1436.4339 1439.8257 1448.3369 1459.0192 1465.4809 1466.1009 1466.8823 1474.8276 1479.6207 1483.0806 1484.7934 1489.3308 1496.0351 1570.3840 1577.9080 1591.0254 1615.7409 2874.7677 2882.4657 2947.6503 2958.4706 2968.5230 2973.5114 2992.6429 3012.1806 3045.7986 3055.8319 3063.4832 3072.6108 3092.3586 3124.1926 3131.3654 3141.1957 3143.2993 3155.9647 3169.8503 3173.0866 3175.0640 3431.8859
redmass: 3.5979 4.3928 4.6473 2.6678 3.1587 3.5446 2.7023 3.2219 3.9650 3.8422 2.8013 2.7363 1.5248 2.1876 1.9022 1.3377 2.0216 3.5975 2.9114 3.5314 5.0985 4.3484 5.1328 4.4378 4.5587 2.7095 3.7176 3.1964 4.2314 3.5536 4.2158 4.2474 5.0447 5.5735 6.1592 4.3243 5.6699 1.3389 5.0262 4.3044 3.1818 1.3902 1.3900 5.4011 2.2837 1.3819 1.5975 2.3895 1.3826 1.3365 1.4057 1.8554 2.1488 1.5211 1.7230 4.8386 6.0213 4.6636 2.1206 1.4222 3.3191 1.7165 1.2599 1.8242 1.8890 1.4903 2.1499 2.2228 1.6804 1.2272 1.4179 2.2642 1.7204 1.2744 1.5079 1.9934 1.8790 1.3578 1.9102 1.3542 1.4574 1.4783 5.7579 1.2652 7.0567 2.3977 2.0730 1.1522 1.5242 1.1968 2.4458 1.0683 1.0692 1.0504 1.1008 1.2176 1.4134 1.3983 1.0895 1.0568 6.3948 7.0636 6.7287 7.1512 1.0579 1.0655 1.0692 1.0330 1.0377 1.0847 1.0884 1.0759 1.1039 1.0971 1.0930 1.0995 1.0983 1.0993 1.0849 1.0899 1.0890 1.0937 1.1005 1.0922 1.0934 1.0742
irintensity: 0.2027 0.3314 1.4326 0.3044 5.7395 0.3151 3.8689 0.8805 0.7174 0.8014 3.2091 0.6176 0.5966 0.9512 1.4406 1.7345 1.1347 0.2730 0.4283 2.9034 2.1357 4.1097 3.9431 1.2211 2.0468 7.2636 1.7465 0.6599 12.3038 4.2374 1.0628 6.1673 17.4510 6.3505 6.9657 0.5078 12.4400 90.9428 2.5008 1.5962 11.5837 90.6444 35.3049 1.8698 3.4140 0.2667 44.3924 5.9054 4.2705 0.8436 3.0419 7.2742 1.8134 3.0325 4.9909 87.8782 15.1596 7.4672 17.5544 15.8807 18.3732 1.6887 0.1454 29.8314 30.3019 7.2527 34.7819 65.8666 17.1014 14.8917 35.3862 115.5900 25.3111 6.2401 36.6481 82.9104 7.4666 18.9120 77.0053 4.4283 3.1350 4.4492 35.5601 23.7797 22.9652 30.4299 1.4531 0.5035 22.8582 20.0299 315.2228 17.5663 13.3506 12.6316 38.4998 5.0572 29.7863 8.6106 8.7886 7.7281 26.0787 11.2696 149.3010 76.6918 81.3242 112.2177 44.0197 82.2800 40.7834 4.5458 46.2670 52.4358 48.2021 15.0237 47.7580 39.3337 14.8668 26.1226 2.0065 7.9371 4.5016 23.5247 24.4982 9.5223 5.2920 1.4324
temp: 298.150 k
press: 1.00000 atm
elementType: 16 8 7 7 6 6 6 6 6 6 6 6 6 6 6 6 6 6 6 6 6 6 1 1 1 1 1 1 1 1 1 1 1 1 1 1 1 1 1 1 1 1 1 1
symmnumber: 1
zpe: 948183.3 jmol-1
zpe.correction: 0.361144 hartree
zpe.thermalcorrener: 0.382914 hartree
zpe.thermalcorrenthalpy: 0.383858 hartree
zpe.thermalcorrgfe: 0.309433 hartree
zpe.sumelectzpe: -1280.247533 hartree
zpe.sumelectthermal: -1280.225763 hartree
zpe.sumelectthermalent: -1280.224818 hartree
zpe.sumelectthermalfe: -1280.299244 hartree
dipole: -1.5049 -0.4615 -0.3091
dipole: 1.6041
quadrupole: -115.8767 -143.2986 -134.2625
quadrupole: 5.0542 -7.2621 -1.8206
quadrupole: 15.2693 -12.1527 -3.1166 5.0542 -7.2621 -1.8206
hfenergy: -1280.6086769 hartree
pointgroup: C01[X(C18H22N2O1S1)]
dipole: 0.5852484 0.1721653 -0.1616769 debye
polarizability: 318.2568613|-18.2106968|192.8750749|7.5352404|28.35532|197.344405 unknown
InChI: InChI=1S/C18H22N2OS/c1-13(11-19-2)12-20-15-6-4-5-7-17(15)22-18-9-8-14(21-3)10-16(18)20/h4-10,13,19H,11-12H2,1-3H3
charge 0 multiplicity 1
44 atoms
S  -0.807504 1.612307 2.016127
O  4.216698 0.454304 -1.137594
N  -0.569521 -0.055868 -0.532098
N  -0.161081 -3.852087 1.561065
C  0.045996 -2.516609 -0.536839
C  -0.559006 -1.316133 -1.313602
C  -0.846744 -2.88734 0.671535
C  0.671713 0.508039 -0.109857
C  -1.757719 0.739375 -0.482824
C  0.235512 -3.717843 -1.488675
C  0.715429 1.380584 1.016993
C  -1.997314 1.610526 0.617403
C  1.877498 0.243959 -0.801276
C  -2.7242 0.705366 -1.525449
C  1.921618 1.9814 1.412028
C  -3.155613 2.409456 0.679895
C  3.096646 0.819361 -0.370865
C  3.132835 1.699885 0.736256
C  -3.904545 1.475795 -1.444441
C  -4.128741 2.331315 -0.343345
C  -0.997907 -4.359755 2.665559
C  5.50629 1.038905 -0.765578
H  1.040622 -2.2193 -0.146465
H  -0.03031 -1.190996 -2.282722
H  -1.607003 -1.566554 -1.552124
H  -1.774392 -3.372267 0.301941
H  -1.155115 -1.954244 1.203708
H  0.544933 -4.601897 -0.905872
H  1.002278 -3.513488 -2.259654
H  -0.711894 -3.966337 -2.006758
H  1.901537 -0.39916 -1.684124
H  0.725675 -3.45937 1.907792
H  -2.548903 0.089743 -2.412856
H  1.924975 2.660875 2.270798
H  -3.300386 3.078347 1.535017
H  4.063619 2.159935 1.077532
H  -4.63853 1.419567 -2.255799
H  -5.038719 2.936801 -0.282409
H  -1.435133 -3.563504 3.316861
H  -0.402219 -5.037539 3.302816
H  -1.838827 -4.945975 2.249841
H  5.803989 0.740427 0.258724
H  5.483578 2.143939 -0.837098
H  6.225783 0.634853 -1.492865
