program: Gaussian 09
title: 000169880
version: EM64L-G09RevD.01
frameworkgroup: C1[X(C8H10O4)]
method: RPBEPBE
basis: SDD
operation: Freq
keyword: #pfreq=noraman
keyword: PBEPBE/SDD
title: #p freq=noraman PBEPBE/SDD
converged: YES YES NO NO
title: Mulliken charges:
elementType: O O O O C C C C C C C C H H H H H H H H H H
charge: -0.440248 -0.354575 -0.239317 -0.358419 -0.095806 -0.545841 -0.512657 0.250109 -0.066452 0.092982 0.283064 -0.739399 0.217255 0.257744 0.246128 0.235979 0.276475 0.343684 0.377133 0.263500 0.266719 0.241942
chargesum: 0.00000
title: Mulliken charges with hydrogens summed into heavy atoms:
elementType: O O O O C C C C C C C C
charge: -0.096564 -0.354575 -0.239317 0.018714 0.121449 -0.041969 -0.000203 0.250109 -0.066452 0.092982 0.283064 0.032762
polarizability: 1.20017743e+02 -4.90950729e+00 1.11621267e+02 -7.99863566e+00 -7.02028509e-01 6.51116765e+01
1716.lowfreq: -13.4202 -7.2495 -0.0002 0.0007 0.0009 6.3394 57.1351 70.4983 116.4399
frequency: 57.1195 70.4140 116.4317 150.8587 184.8271 236.2017 250.1348 304.8517 332.5044 348.6369 371.3670 401.7743 465.3138 486.3242 494.4601 539.4507 566.6022 585.3565 622.7025 672.5844 773.5105 829.1633 878.8270 929.4462 949.9072 985.2605 1023.3499 1032.1325 1037.4057 1050.5854 1073.6919 1144.1038 1175.6703 1197.5658 1214.5727 1272.2059 1289.6207 1314.8215 1333.2618 1345.9443 1377.6315 1391.9546 1396.9038 1423.4701 1430.9417 1434.9218 1454.5454 1504.1751 1575.2530 1595.9422 1925.9212 2965.4865 2984.6330 2999.0703 3004.3961 3054.1603 3082.7360 3084.5398 3130.8608 3561.4175
redmass: 4.6363 3.5399 5.8100 1.1748 4.0326 6.5717 4.1210 1.1578 2.6653 2.2088 3.3575 3.8991 7.2688 5.3208 5.2305 3.3353 3.9338 3.4405 4.5444 3.3794 5.8388 3.5693 2.1337 2.5754 2.6618 3.5389 2.2480 1.7670 2.3654 2.4289 1.8981 1.1315 1.1987 1.0691 1.1900 3.7090 2.1607 2.6860 1.6272 1.6265 1.7625 1.3152 1.8580 1.1030 1.0486 1.1161 1.7837 5.1108 5.0109 3.2303 1.0874 1.0803 1.0667 1.0687 1.0367 1.0958 1.0937 1.0948 1.1032 1.0662
irintensity: 2.3131 4.8690 1.5383 1.4973 0.6551 0.6323 4.0423 147.6809 7.5935 40.2227 2.9101 21.1068 10.8942 20.7110 11.0720 3.0637 3.1294 12.7675 17.4142 3.1280 10.3312 21.6364 2.4101 5.4517 11.4918 26.8885 5.3240 10.8693 86.7083 61.2078 8.1866 29.9907 17.6253 126.1480 10.6178 63.3109 15.3957 7.1370 10.9277 3.3390 6.0775 94.8110 10.3242 20.3092 18.1617 45.7811 85.6079 492.2554 25.6194 745.1287 263.8637 57.4518 15.4685 22.9067 1.7159 13.5597 1.8257 4.5387 19.1241 5.2301
temp: 298.150 k
press: 1.00000 atm
elementType: 8 8 8 8 6 6 6 6 6 6 6 6 1 1 1 1 1 1 1 1 1 1
symmnumber: 1
zpe: 439555.4 jmol-1
zpe.correction: 0.167418 hartree
zpe.thermalcorrener: 0.178810 hartree
zpe.thermalcorrenthalpy: 0.179755 hartree
zpe.thermalcorrgfe: 0.130207 hartree
zpe.sumelectzpe: -610.843047 hartree
zpe.sumelectthermal: -610.831655 hartree
zpe.sumelectthermalent: -610.830710 hartree
zpe.sumelectthermalfe: -610.880258 hartree
dipole: 2.9570 -1.2626 -1.3005
dipole: 3.4683
quadrupole: -60.8378 -82.7002 -68.4021
quadrupole: -7.3702 -2.2635 -2.1345
quadrupole: 9.8089 -12.0535 2.2446 -7.3702 -2.2635 -2.1345
hfenergy: -611.0104651 hartree
pointgroup: C01 [X(C8H10O4)]
dipole: -1.2227025 0.5518274 -0.2499263 debye
dipolederiv: -0.5104507 -0.188883 0.0071148 -0.2660245 -0.3049785 0.163682 0.0908254 0.1540124 -0.7757404 -0.7081723 -0.2407658 -0.056162 0.1030956 -1.1087724 -0.1741258 -0.0143318 -0.2162398 -0.4002373 -0.6268921 0.230393 0.0762309 0.0240756 -0.9872729 -0.1921001 -0.0041271 -0.1771982 -0.3701313 -0.9214076 -0.0617761 -0.041612 -0.4115617 -0.8664619 -0.1539952 -0.1389958 -0.128493 -0.3833525 0.4443374 0.084091 -0.0339826 0.1372927 0.3002768 -0.0922961 -0.0475503 -0.0833375 0.6957938 -0.3393026 -0.0542792 -0.0204856 -0.0401696 -0.0763732 0.0745092 -0.1125903 0.0238116 0.0126328 -0.3493428 0.0045202 0.015319 -0.0118332 -0.0367947 -0.0540375 -0.0584381 -0.0286669 0.0424795 0.9392997 -0.1199112 0.002399 -0.4544559 1.2299136 0.2578801 -0.0057744 0.2871059 0.2247567 -1.4279579 0.0443004 -0.0541682 0.1800315 -0.9382274 -0.199519 -0.0724543 -0.2087166 -0.1765412 1.0798131 0.1343035 0.0323656 0.2446607 1.2887804 0.2989928 0.1029185 0.3041608 0.2390787 1.5687899 -0.0560213 0.0703811 0.1817161 0.7680026 0.1549196 0.1578617 0.1340328 0.2180866 -0.0930046 0.1919551 0.0493822 0.3751519 -0.3047116 -0.0398463 0.0908363 -0.055743 -0.0437812 -0.2558487 0.0091959 -0.0688554 0.0074719 0.0451352 0.0287093 -0.0235424 0.0197077 -0.0412666 0.0305422 0.0166941 0.0415013 0.0269077 -0.0093729 -0.0738933 0.0963327 -0.1098595 0.0267796 0.0359009 0.0081961 -0.0187755 -0.0308892 0.0898147 0.0424193 -0.021656 0.0706087 -0.0652594 0.0453441 0.0136127 -0.0272411 0.053258 0.1014545 0.0447786 -0.017068 0.0061995 -0.0797046 0.0535033 -0.014857 0.0214815 -0.0498883 -0.049372 0.0175648 0.0422192 0.0394151 0.1134047 0.3033295 0.1252371 0.0317053 0.1871901 0.128519 -0.1415827 -0.0065327 -0.0744085 0.2464966 0.6768421 -0.0912719 -0.0091923 -0.1263254 0.4419544 0.0176 -0.0149745 0.0144607 0.3465128 0.0815239 0.0098014 -0.0464065 -0.000051 0.1334544 -0.0326072 -0.0233422 -0.0292721 -0.0081749 0.0676257 -0.0278744 0.0494047 -0.0241147 0.0748869 0.0716302 0.0267208 0.0698318 0.0612661 -0.0944724 -0.0166604 -0.0204042 -0.1055382 0.0801449 -0.0186827 -0.0463367 -0.0114121 0.1169016 unknown
polarizability: 121.2886466|-4.8767325|107.9880339|0.4528978|12.3930787|67.4740057 unknown
InChI: InChI=1S/C8H10O4/c1-4(9)8-6(11)2-5(10)3-7(8)12/h5,9-10H,2-3H2,1H3
charge 0 multiplicity 1
22 atoms
O  -2.187055 -0.325615 1.38188
O  0.325564 2.593695 0.170086
O  0.471385 -2.063726 -1.04982
O  2.487034 1.542946 0.042652
C  -2.382782 0.081931 -0.021694
C  -1.768352 1.468726 -0.295105
C  -1.694596 -0.996986 -0.863448
C  -0.260483 1.46708 -0.163939
C  0.513611 0.271055 -0.420508
C  -0.161388 -0.995148 -0.779627
C  1.942937 0.365377 -0.292479
C  2.915545 -0.754248 -0.499614
H  -3.466656 0.109852 -0.2612
H  -2.173684 2.245353 0.37907
H  -2.023688 1.783999 -1.327945
H  -1.974682 -0.867433 -1.92831
H  -2.041774 -1.997614 -0.556352
H  -2.604359 0.3424 1.982949
H  1.636624 2.268057 0.171244
H  2.821467 -1.168895 -1.518486
H  2.681234 -1.60223 0.167492
H  3.936598 -0.384576 -0.319345
