program: Gaussian 09
title: 000169864
version: EM64L-G09RevD.01
frameworkgroup: C1[X(C12H20O)]
method: RPBEPBE
basis: SDD
operation: Freq
keyword: #pfreq=noraman
keyword: PBEPBE/SDD
title: #p freq=noraman PBEPBE/SDD
converged: NO YES NO NO
title: Mulliken charges:
elementType: O C C C C C C C C C C C C H H H H H H H H H H H H H H H H H H H H
charge: -0.447373 -0.087797 0.094844 -0.010849 -0.459884 -0.479123 -0.399757 -0.395881 -0.394244 -0.740130 0.225043 -0.713512 -0.545891 0.210500 0.185382 0.213724 0.202613 0.223431 0.195149 0.202207 0.190643 0.200094 0.216551 0.202280 0.197819 0.225646 0.193526 0.233199 0.335548 0.212935 0.209200 0.217785 0.286324
chargesum: 0.00000
title: Mulliken charges with hydrogens summed into heavy atoms:
elementType: O C C C C C C C C C C C C
charge: -0.111825 0.122703 0.094844 0.174533 -0.043547 -0.060542 -0.006907 0.020764 0.005855 -0.087759 0.225043 -0.073592 -0.259567
polarizability: 1.36504406e+02 -1.84620545e+00 1.26323914e+02 3.17699809e+00 -7.80531676e+00 1.19293715e+02
1716.lowfreq: -12.8784 -0.0007 0.0002 0.0004 8.6759 16.0627 43.6868 67.9391 87.8390
frequency: 43.4000 67.9214 87.8108 115.4748 126.7676 183.1419 195.7145 227.7317 249.2224 255.2186 269.4851 290.0254 310.5863 319.8587 330.8845 375.6671 399.8039 414.7286 466.8245 484.8444 524.9612 587.7336 589.1366 626.4266 659.3806 678.5209 762.9826 789.9077 828.8998 850.8254 864.1512 898.5404 927.9306 937.3346 964.3640 970.5920 992.4636 1010.0638 1024.7058 1050.3030 1073.8614 1089.9424 1106.0036 1126.2165 1147.8363 1163.7980 1166.7690 1184.7145 1227.0126 1253.0668 1260.2704 1269.7145 1288.9228 1302.5765 1324.0589 1328.1581 1331.3793 1337.2253 1339.8617 1353.4529 1357.1610 1385.1208 1393.8397 1457.3341 1459.6656 1461.0996 1467.2862 1471.0259 1471.9164 1473.7871 1486.5320 1488.0133 2118.8202 2939.0377 2959.9713 2967.8870 2970.2096 2974.3910 2974.9788 2976.5798 2983.5418 2988.6238 3017.6414 3032.3326 3033.6635 3043.1002 3050.7860 3066.4535 3074.3242 3079.5969 3105.2897 3426.2456 3534.2570
redmass: 3.0392 1.9988 3.4199 3.4610 3.0154 1.8514 2.4126 1.7535 1.3068 2.3652 1.1534 2.8148 2.8639 2.2666 2.2048 3.3965 3.4362 2.6332 2.8417 2.7703 2.4965 4.6132 3.0007 1.2186 1.2612 3.6799 1.2963 1.5847 1.8565 2.1256 2.3588 1.5557 2.3115 2.2621 1.4970 1.5905 2.3697 1.8068 1.9221 2.3797 2.0728 1.8272 1.9024 1.8727 1.6973 2.3039 2.0829 1.5554 1.3659 1.2933 1.3462 1.2416 1.2135 1.5069 1.4376 1.4557 1.3590 1.4459 1.4388 1.3289 1.5087 1.2188 1.1969 1.0882 1.0668 1.0755 1.0801 1.0677 1.0435 1.0904 1.0604 1.0471 6.0561 1.0814 1.0756 1.0630 1.0625 1.0591 1.0371 1.0684 1.0634 1.0379 1.0998 1.0971 1.1014 1.0980 1.1028 1.0993 1.0988 1.0976 1.0987 1.1577 1.0659
irintensity: 0.0977 0.0240 0.9072 0.1011 0.1024 0.9842 0.4410 1.9806 0.5401 11.8891 95.7070 7.0134 1.1734 2.0016 13.9752 2.1651 8.4967 1.5588 6.7872 2.3464 5.5219 0.6879 1.7460 75.1606 54.8462 7.4718 8.0702 5.9996 2.1413 24.8112 8.6346 3.7196 12.4557 26.7674 6.1886 14.5437 24.7021 21.0068 18.5113 2.3485 3.3777 2.4324 1.2858 0.4337 7.8061 4.9936 3.1462 20.3883 0.2498 3.2558 3.9958 6.9854 0.4361 19.7267 10.8787 1.1514 8.0349 2.9082 0.4932 2.0463 3.7073 14.5572 18.0188 5.6736 1.7369 12.6450 13.1466 0.6316 8.4572 8.7545 13.1887 13.3808 1.0185 9.0927 2.2671 32.2333 22.2940 21.4366 40.0113 66.6078 42.8906 39.1659 21.0036 56.4443 44.6030 13.9794 84.1390 53.6616 59.6401 39.1846 30.4773 61.5787 4.3760
temp: 298.150 k
press: 1.00000 atm
elementType: 8 6 6 6 6 6 6 6 6 6 6 6 6 1 1 1 1 1 1 1 1 1 1 1 1 1 1 1 1 1 1 1 1
symmnumber: 1
zpe: 760344.6 jmol-1
zpe.correction: 0.289600 hartree
zpe.thermalcorrener: 0.304433 hartree
zpe.thermalcorrenthalpy: 0.305378 hartree
zpe.thermalcorrgfe: 0.248975 hartree
zpe.sumelectzpe: -543.387260 hartree
zpe.sumelectthermal: -543.372427 hartree
zpe.sumelectthermalent: -543.371483 hartree
zpe.sumelectthermalfe: -543.427886 hartree
dipole: 1.5382 0.5290 0.6014
dipole: 1.7342
quadrupole: -79.0914 -78.7800 -80.0495
quadrupole: -3.2477 -0.9072 -2.3912
quadrupole: 0.2155 0.5270 -0.7425 -3.2477 -0.9072 -2.3912
hfenergy: -543.6768604 hartree
pointgroup: C01 [X(C12H20O1)]
dipole: -0.6051997 -0.1867273 0.2537713 debye
polarizability: 136.5308384|-2.1269956|127.712918|-2.9671868|6.9935546|117.878278 unknown
InChI: InChI=1S/C12H20O/c1-4-10(3)11-8-6-7-9-12(11,13)5-2/h2,10-11,13H,4,6-9H2,1,3H3
charge 0 multiplicity 1
33 atoms
O  -0.619878 1.431446 -1.698568
C  0.22066 -0.440727 -0.36205
C  -0.958359 0.574052 -0.526685
C  1.618966 0.138689 0.061772
C  -0.203269 -1.543446 0.655517
C  -2.283639 -0.173044 -0.880672
C  -1.509651 -2.275556 0.279761
C  -2.669929 -1.268083 0.133566
C  2.73274 -0.872191 -0.357176
C  1.968006 1.547959 -0.473519
C  -1.156817 1.417169 0.678242
C  4.070889 -0.691559 0.393403
C  -1.372603 2.13589 1.657515
H  0.327561 -0.900437 -1.368963
H  1.615988 0.196697 1.173072
H  -0.329134 -1.068642 1.650677
H  0.619248 -2.27477 0.759242
H  -2.125248 -0.626386 -1.879178
H  -3.098077 0.572594 -0.978307
H  -1.752253 -3.033028 1.049687
H  -1.370363 -2.819732 -0.677178
H  -3.594525 -1.774936 -0.20274
H  -2.891146 -0.807414 1.116746
H  2.901987 -0.767495 -1.449044
H  2.38306 -1.910981 -0.196185
H  1.943646 1.572197 -1.576329
H  2.979882 1.839415 -0.134372
H  1.259256 2.310545 -0.113082
H  -1.345669 2.100352 -1.806605
H  4.815181 -1.440067 0.063453
H  3.930591 -0.813701 1.484449
H  4.507284 0.308649 0.221117
H  -1.536585 2.763239 2.514334
