program: Gaussian 09
title: 000169844
version: EM64L-G09RevD.01
frameworkgroup: C1[X(C6H10O3)]
method: RPBEPBE
basis: SDD
operation: Freq
keyword: #pfreq=noraman
keyword: PBEPBE/SDD
title: #p freq=noraman PBEPBE/SDD
converged: YES YES NO NO
title: Mulliken charges:
elementType: O O O C C C C C C H H H H H H H H H H
charge: -0.245352 -0.235745 -0.252170 -0.226068 -0.670416 0.213057 0.253858 -0.533060 -0.627818 0.230255 0.230202 0.208830 0.232498 0.232543 0.224310 0.224341 0.248038 0.233353 0.259344
chargesum: 0.00000
title: Mulliken charges with hydrogens summed into heavy atoms:
elementType: O O O C C C C C C
charge: -0.245352 -0.235745 -0.252170 0.234389 0.003456 0.213057 0.253858 0.163629 -0.135121
polarizability: 1.00824470e+02 -7.10265268e+00 8.43577252e+01 -3.89438175e-02 2.69949410e-02 4.74194511e+01
1716.lowfreq: -8.1514 -4.1352 -0.0008 0.0003 0.0010 12.5682 46.7010 69.5647 100.6851
frequency: 46.3244 69.2455 100.6752 112.7065 145.3974 245.4700 245.6377 247.6609 335.8055 338.5201 390.0398 459.9313 477.4130 640.7957 693.3052 750.3513 792.9937 799.8795 846.9465 883.6919 898.9003 1015.8882 1023.3487 1112.8173 1113.2938 1129.1032 1134.8529 1159.6000 1249.8945 1299.4817 1359.4295 1385.8584 1403.5100 1439.8033 1462.8698 1463.0600 1472.0904 1473.1748 1485.9741 1608.2692 1618.1876 2960.2861 2997.5212 3009.1321 3048.2593 3068.1464 3093.9551 3110.7526 3132.2027 3138.8935 3250.2194
redmass: 2.8723 3.7781 2.6358 3.6480 2.7168 1.4981 2.3352 1.1371 3.9326 2.7510 4.1897 4.2317 5.9403 3.2512 1.3563 3.6305 5.0829 1.1086 3.8166 1.3751 2.8724 3.7857 2.3320 2.3011 1.2671 4.2938 1.4634 1.5368 1.1347 3.2722 1.4719 1.2497 1.2757 1.1822 1.0421 1.0471 1.0580 1.0572 1.0668 11.0503 5.4137 1.0326 1.0361 1.0580 1.1037 1.1069 1.0984 1.1023 1.0998 1.0608 1.1156
irintensity: 1.3180 1.8425 10.6987 3.8278 0.0054 1.0283 2.1880 0.4273 13.0346 1.3732 4.0292 3.3476 0.5989 5.1013 0.0158 18.3616 11.7564 3.0282 19.8855 89.6642 0.3562 36.9789 45.8715 16.8625 0.2905 372.6793 5.9248 37.6157 0.0001 246.2268 9.5563 36.7775 12.9287 7.7594 23.5867 2.3202 10.3096 8.9968 13.2406 192.3128 16.3008 42.4878 21.0515 18.4354 46.3737 10.6814 29.4281 42.4113 17.2687 5.3370 2.1880
temp: 298.150 k
press: 1.00000 atm
elementType: 8 8 8 6 6 6 6 6 6 1 1 1 1 1 1 1 1 1 1
symmnumber: 1
zpe: 399203.2 jmol-1
zpe.correction: 0.152048 hartree
zpe.thermalcorrener: 0.162610 hartree
zpe.thermalcorrenthalpy: 0.163554 hartree
zpe.thermalcorrgfe: 0.115416 hartree
zpe.sumelectzpe: -459.552852 hartree
zpe.sumelectthermal: -459.542290 hartree
zpe.sumelectthermalent: -459.541346 hartree
zpe.sumelectthermalfe: -459.589484 hartree
dipole: -1.0718 -2.0110 0.0082
dipole: 2.2788
quadrupole: -36.2223 -58.6811 -54.3609
quadrupole: 1.4824 -0.0096 0.0282
quadrupole: 13.5325 -8.9263 -4.6062 1.4824 -0.0096 0.0282
hfenergy: -459.7049001 hartree
pointgroup: C01 [X(C6H10O3)]
dipole: 0.3612083 0.817406 0.0720783 debye
dipolederiv: -1.5040022 0.4413418 -0.051905 0.5278433 -0.6785157 0.0086253 -0.0463306 0.0029614 -0.2697062 -0.4994635 -0.2898832 -0.0306868 -0.1702808 -1.1888318 -0.0604384 -0.0239629 -0.068088 -0.2733396 -0.7033464 -0.1513395 -0.0330797 0.0265063 -0.9045773 -0.0337712 -0.0219194 -0.0445791 -0.325749 0.953692 -0.1481579 0.0289814 -0.0138723 0.2423346 -0.0080096 0.0370325 -0.0165296 0.3598164 -0.0680789 0.0980324 -0.0022283 0.0809522 -0.0301889 0.0004206 -0.0034473 0.0015236 0.0564122 1.7668975 -0.229333 0.0823564 -0.4367252 1.2102034 0.0315352 0.0691754 0.0440869 0.2535442 -0.2205423 -0.0881645 -0.0245415 0.0983234 1.1162096 0.0607327 -0.0153523 0.0484411 0.0900978 0.4274043 0.3315961 0.0242509 0.1065208 0.4050192 0.0111079 0.0124466 0.0259621 0.3291376 -0.1656839 0.3105404 0.035059 -0.0808029 -0.3270121 0.0015042 0.0133908 0.027349 -0.4471602 -0.0581361 0.0421816 0.0112595 -0.0391904 0.0121151 -0.0935834 -0.0343355 -0.0912502 -0.0718875 -0.0613657 0.0306345 -0.0067237 -0.0550597 -0.0103132 0.0947649 0.0288539 0.1031844 -0.0466985 -0.1700395 -0.0350904 -0.020501 -0.0603096 0.0594806 -0.0072619 -0.0219643 -0.0056047 0.1139571 0.1180332 -0.0246115 -0.0386569 0.0281046 0.0211809 -0.0893678 -0.0100603 -0.1089544 -0.0774684 0.1088542 -0.044757 0.0572897 0.0129658 -0.0027687 0.1001888 0.0352115 0.1125917 -0.0440517 -0.055702 -0.0868832 0.0836417 0.053474 0.059624 -0.0774237 0.1022355 -0.0202916 -0.0796866 -0.0315719 -0.0803494 -0.0869043 0.0526422 0.0475159 0.0997977 -0.0907411 0.0246054 -0.0913459 0.0823501 0.0302124 -0.000985 -0.02175 -0.1273952 -0.015149 -0.003841 -0.0118127 0.1225341 -0.0559296 -0.0664827 -0.0203889 -0.0761983 0.0830575 -0.0114984 -0.0206516 -0.0108076 0.2027774 0.1366307 -0.0394869 -0.0062373 -0.0331433 0.0128621 -0.0121739 -0.0057401 -0.0127876 0.1988167 unknown
polarizability: 101.5619851|-5.9847687|83.3319278|3.1069105|1.6260702|47.7077335 unknown
InChI: InChI=1S/C6H10O3/c1-4-9-6(7)5(2)8-3/h2,4H2,1,3H3
charge 0 multiplicity 1
19 atoms
O  -1.15779 0.259999 0.058318
O  1.246688 1.223949 0.257093
O  -0.44116 -1.95505 -0.029707
C  -2.568365 -0.22514 -0.060658
C  -3.455194 1.015236 -0.045913
C  -0.184775 -0.727864 0.059714
C  1.207544 -0.167992 0.179914
C  2.576601 1.829997 0.377555
C  2.273951 -1.019101 0.203114
H  -2.658607 -0.803883 -0.997912
H  -2.773297 -0.907379 0.784384
H  -4.516255 0.717509 -0.132135
H  -3.325547 1.579436 0.893116
H  -3.209804 1.683062 -0.88895
H  3.204073 1.586801 -0.502294
H  3.085677 1.487528 1.299743
H  2.395115 2.913154 0.425123
H  3.308784 -0.679411 0.288312
H  2.082261 -2.091652 0.132782
