program: Gaussian 09
title: 000169850
version: EM64L-G09RevD.01
frameworkgroup: C1[X(C5H13NO3S)]
method: RPBEPBE
basis: SDD
operation: Freq
keyword: #p
keyword: freq=noraman
keyword: PBEPBE/SDD
title: #p freq=noraman PBEPBE/SDD
converged: YES YES NO NO
title: Mulliken charges:
elementType: S O O O N C C C C C H H H H H H H H H H H H H
charge: 1.034981 -0.575346 -0.518471 -0.516578 -0.572270 -0.360429 -0.323270 -0.352334 -0.604044 -0.390475 0.201274 0.198489 0.236650 0.236292 0.226047 0.190012 0.290539 0.290814 0.207829 0.179951 0.262542 0.278014 0.379783
chargesum: 0.00000
title: Mulliken charges with hydrogens summed into heavy atoms:
elementType: S O O O N C C C C C
charge: 1.034981 -0.195563 -0.518471 -0.516578 -0.031713 0.039334 0.149672 0.063724 -0.022691 -0.002695
polarizability: 1.34899319e+02 2.13395997e+00 8.77033773e+01 -8.07844326e-01 9.93528349e-01 8.30837245e+01
1716.lowfreq: -0.0028 -0.0022 -0.0015 4.0697 7.6226 16.8304 26.5827 53.9466 62.6910
frequency: 25.3974 52.8733 62.6572 71.5639 117.0838 140.5454 145.6167 175.5598 181.5279 226.7467 237.5438 265.1688 299.9463 315.6346 364.8691 415.1819 457.0459 554.2003 585.6525 606.8979 745.6621 769.9574 827.2461 844.7702 919.4255 950.8938 974.0270 1013.8414 1029.0879 1050.5865 1069.5352 1088.1194 1100.6816 1118.6499 1202.3354 1225.3182 1250.6912 1276.8647 1286.1950 1294.2599 1302.4222 1334.1739 1352.0692 1388.6586 1414.0908 1466.6108 1472.3708 1486.0248 1493.8787 1640.8789 2861.6881 2964.8560 2971.7651 2998.3949 3010.5297 3013.7429 3050.0436 3055.4896 3065.9160 3147.1137 3462.4151 3502.1009 3590.5049
redmass: 5.3514 1.9656 4.9949 2.9724 1.8738 4.4558 2.3957 1.7980 4.3369 1.2815 2.0240 2.9119 4.7993 8.2435 7.1021 3.8415 3.6070 13.5745 1.3784 4.1210 1.0682 1.1222 1.2467 11.9577 1.7242 2.6757 2.2461 2.7989 1.7447 1.8273 2.3801 1.9493 1.7462 1.9435 1.4973 1.2734 1.2850 1.2443 1.0462 1.2354 1.0940 1.3169 1.4778 1.4497 1.1053 1.0719 1.0784 1.0940 1.0925 1.0945 1.0716 1.0600 1.0636 1.0592 1.0857 1.0989 1.1022 1.0560 1.1046 1.1107 1.0449 1.0665 1.0979
irintensity: 0.9214 1.8089 1.3863 0.6332 1.4926 1.8359 2.9207 39.2756 12.9027 44.7141 45.6789 21.6770 62.1916 7.0407 66.2815 5.3487 20.1725 130.4884 239.5646 9.4366 12.3596 0.4030 0.1879 47.2903 23.2415 27.8026 38.1798 15.8291 49.3957 22.3916 5.8239 9.3730 7.6405 34.2335 6.4347 3.1786 4.9372 4.4478 3.0921 9.0770 2.0910 10.4142 1.4011 15.2987 6.9837 1.3027 1.4475 9.6438 9.2622 38.4000 113.9024 6.1483 41.4007 13.9059 41.5330 1.1998 31.5518 4.7195 56.3161 1.1644 0.7090 48.4997 0.5490
temp: 298.150 k
press: 1.00000 atm
elementType: 16 8 8 8 7 6 6 6 6 6 1 1 1 1 1 1 1 1 1 1 1 1 1
symmnumber: 1
zpe: 486794.0 jmol-1
zpe.correction: 0.185410 hartree
zpe.thermalcorrener: 0.199288 hartree
zpe.thermalcorrenthalpy: 0.200232 hartree
zpe.thermalcorrgfe: 0.143338 hartree
zpe.sumelectzpe: -875.788906 hartree
zpe.sumelectthermal: -875.775029 hartree
zpe.sumelectthermalent: -875.774084 hartree
zpe.sumelectthermalfe: -875.830979 hartree
dipole: -3.6131 3.1708 -1.0895
dipole: 4.9291
quadrupole: -60.7112 -74.8053 -75.5342
quadrupole: 2.9201 4.2130 2.0709
quadrupole: 9.6390 -4.4551 -5.1840 2.9201 4.2130 2.0709
hfenergy: -875.9743165 hartree
pointgroup: C01 [X(C5H13N1O3S1)]
dipole: -1.4439121 1.2258714 -0.4159646 debye
dipolederiv: 1.4896291 0.1581082 -0.020061 0.1511252 1.4162991 -0.0208253 -0.0215571 -0.0192387 1.3345795 -0.8634612 -0.4172353 0.0643441 -0.4538452 -0.7088633 0.0347936 0.0740613 0.0335318 -0.591747 -0.6091988 0.0302941 0.0122735 0.1055995 -0.5533999 -0.0696637 0.0141406 -0.1290511 -0.6132348 -0.6096766 0.0415828 -0.0324139 0.1130905 -0.5136271 0.0372283 -0.0543987 0.102631 -0.6477326 -0.6813404 -0.1427454 -0.0194411 -0.1993985 -0.5226326 0.2675179 0.0482029 0.2629888 -0.4934519 -0.0329538 -0.0196281 0.0024677 -0.295105 0.1146449 0.006925 0.0087084 0.000554 0.2043543 -0.2274286 0.0136041 0.0031117 0.2650996 -0.009956 -0.0044768 -0.0130728 -0.0007368 0.1108868 -0.1215355 0.0166086 -0.0136638 0.2402891 0.0623565 0.0165089 -0.0080397 0.0480822 0.1570959 0.4437677 -0.044188 -0.0133734 0.0068938 -0.0086105 -0.0013254 -0.0076453 -0.0032803 -0.0215353 0.5503711 0.2158744 -0.0457488 0.0445244 0.3649638 -0.1269308 0.0461083 -0.0878709 0.3457807 0.0519894 -0.0048954 -0.0052008 0.0070277 -0.0428574 -0.1070602 -0.000807 -0.1326929 -0.0636201 0.0597546 0.00476 -0.000295 0.0040129 -0.0259444 0.1043355 0.0007824 0.1301156 -0.0872664 0.0768842 0.0084474 -0.0178046 -0.0194028 0.0222184 0.0741538 -0.0073966 0.0885585 -0.0357401 0.0847572 0.0066118 0.0116883 -0.0252686 0.0073799 -0.0763517 0.0012105 -0.090084 -0.0191345 0.0521118 0.0149207 -0.0266156 0.009147 -0.0121949 0.1020217 -0.0246393 0.1095974 -0.0658716 0.0344683 0.0024326 0.0214524 -0.0074031 -0.0435993 -0.1131073 -0.0037179 -0.1399891 -0.080755 -0.0074946 0.0299033 0.0069127 0.0102061 0.0282767 -0.0504852 -0.0518423 -0.0542696 0.0229075 -0.003103 0.0296883 -0.008882 0.0169964 0.0408859 0.0473683 0.0502961 0.0514942 0.0118425 0.0455264 -0.0145824 0.0103314 -0.014177 -0.0494212 -0.1031138 0.0282004 -0.1360274 -0.0862346 -0.0547084 -0.0678144 0.0287924 -0.0413879 -0.1450813 0.1547662 0.0300012 0.2113857 -0.1500628 0.1785605 -0.0411242 0.034873 -0.0502729 0.2244097 -0.1075144 0.0004697 -0.1863399 0.0845878 -0.0264364 0.0321875 0.0190654 0.1031578 0.1602368 -0.0863911 -0.1138761 -0.0760745 0.3207123 0.169517 0.1471893 -0.0118128 0.0290912 0.1945162 0.0216267 0.004811 0.016716 0.3636396 unknown
polarizability: 134.7958261|2.7101313|87.7810936|-1.7471759|0.8893168|83.1095012 unknown
InChI: InChI=1S/C5H13NO3S/c6-4-2-1-3-5-10(7,8)9/h7H,1-6H2
charge 0 multiplicity 1
23 atoms
S  2.711527 -0.15727 -0.114833
O  3.739963 1.383274 -0.362815
O  2.818556 -1.10481 -1.422128
O  3.01558 -0.786617 1.344888
N  -5.155821 -0.504899 0.037306
C  -1.465447 0.639343 -0.055752
C  -0.126237 -0.143511 -0.044635
C  -2.683286 -0.310319 0.002318
C  1.053922 0.823864 -0.116268
C  -4.029098 0.445087 -0.020105
H  -1.497888 1.33445 0.807889
H  -1.523545 1.264196 -0.970757
H  -0.063317 -0.753382 0.876735
H  -0.097334 -0.837621 -0.906116
H  -2.64859 -0.930032 0.918297
H  -2.643012 -1.010705 -0.858341
H  1.161725 1.480967 0.760991
H  1.114667 1.397372 -1.054609
H  -4.089147 1.098662 0.871835
H  -4.045614 1.119685 -0.913054
H  -5.205704 -1.144002 -0.762182
H  -6.064007 -0.083647 0.251348
H  4.703006 1.114713 -0.363711
