program: Gaussian 09
title: 000169830
version: EM64L-G09RevD.01
frameworkgroup: C1[X(C7H8OS)]
method: RPBEPBE
basis: SDD
operation: Freq
keyword: #pfreq=noraman
keyword: PBEPBE/SDD
title: #p freq=noraman PBEPBE/SDD
converged: YES YES NO NO
title: Mulliken charges:
elementType: S O C C C C C C C H H H H H H H H
charge: 0.198308 -0.203351 -0.478804 0.031344 -0.286120 -0.654173 -0.101759 -0.210861 -0.140782 0.231137 0.226644 0.259100 0.229724 0.224702 0.222686 0.283505 0.168700
chargesum: 0.00000
title: Mulliken charges with hydrogens summed into heavy atoms:
elementType: S O C C C C C C C
charge: 0.198308 -0.203351 -0.021023 0.031344 -0.027021 0.022939 -0.101759 0.072644 0.027919
polarizability: 1.48984228e+02 3.13635566e+00 9.31383631e+01 -6.21496297e+00 3.28568816e+00 4.82692544e+01
1716.lowfreq: -9.9944 -6.4575 -0.0021 0.0005 0.0017 4.7826 34.6874 84.0611 151.3766
frequency: 34.6233 84.0490 151.3760 176.3471 215.8390 228.0876 310.2734 362.2365 390.2366 492.2673 538.7170 590.1246 608.1126 704.3991 771.5967 784.5283 831.0863 923.2932 941.6390 972.9522 1013.1175 1055.8448 1066.9843 1130.7196 1174.2651 1219.9279 1263.0315 1301.7181 1344.7831 1387.7901 1392.0969 1460.8889 1474.1723 1481.5145 1495.2996 1546.6394 1583.7027 2889.8834 2982.0161 2988.4627 3039.5349 3087.7630 3095.1979 3170.7876 3194.3357
redmass: 2.9785 4.6494 3.8783 3.4158 1.6041 2.0804 2.4902 3.9917 6.9093 5.6076 4.0928 3.4250 5.7037 5.7008 2.9063 1.4870 1.2433 1.4150 2.0333 1.7091 1.9684 1.8690 1.5647 2.5044 2.6731 1.3901 1.3399 1.5339 2.5395 1.3495 1.2034 1.0765 1.0441 1.1559 4.9392 5.7623 6.2251 1.0848 1.0610 1.0356 1.0991 1.1002 1.1013 1.0916 1.0993
irintensity: 0.1384 0.6628 3.2933 7.9135 3.5257 7.6007 1.7144 1.5802 3.0686 16.3190 12.6116 2.5458 5.5986 1.0546 35.2130 11.7490 53.2461 0.1091 13.1789 2.4897 24.8699 5.4648 5.2718 2.7352 12.0958 25.0670 20.8470 23.8637 3.5940 30.9523 8.9032 8.5132 15.6377 7.7694 244.8457 15.9921 210.1976 97.6106 24.9777 29.1518 7.3701 45.1074 32.0110 4.7747 1.1181
temp: 298.150 k
press: 1.00000 atm
elementType: 16 8 6 6 6 6 6 6 6 1 1 1 1 1 1 1 1
symmnumber: 1
zpe: 340650.2 jmol-1
zpe.correction: 0.129747 hartree
zpe.thermalcorrener: 0.139043 hartree
zpe.thermalcorrenthalpy: 0.139987 hartree
zpe.thermalcorrgfe: 0.094390 hartree
zpe.sumelectzpe: -744.140494 hartree
zpe.sumelectthermal: -744.131197 hartree
zpe.sumelectthermalent: -744.130253 hartree
zpe.sumelectthermalfe: -744.175850 hartree
dipole: 4.9990 0.3248 -0.3663
dipole: 5.0230
quadrupole: -70.8046 -55.2418 -62.6094
quadrupole: 3.1043 0.7822 0.4801
quadrupole: -7.9194 7.6435 0.2759 3.1043 0.7822 0.4801
hfenergy: -744.2702404 hartree
pointgroup: C01 [X(C7H8O1S1)]
dipole: 1.9689655 -0.0511419 0.1608506 debye
dipolederiv: -0.0546435 -0.0218381 -0.02792 -0.0052254 -0.3295591 0.0381588 -0.0447436 0.0391836 0.1086388 -1.3491943 0.0427603 -0.0941961 -0.3584852 -0.3897158 -0.0280669 -0.0758316 0.0095736 -0.3405984 -0.0194954 -0.013613 0.0151675 -0.0902546 0.0828652 0.0322117 0.0507303 0.0348999 0.1111774 0.4379178 -0.1090609 0.0500255 0.2747803 0.3646222 -0.0043389 0.1002598 -0.0362895 -0.1951433 -0.5826625 -0.1285612 -0.009591 -0.3426597 -0.0868334 -0.0367192 -0.0194367 -0.0217161 -0.1602014 0.0015441 -0.0144819 0.0244358 0.0342207 0.0504139 0.0385214 -0.0844222 0.0298248 0.0231715 -0.6791342 0.4158899 -0.0689513 0.9673151 -0.0472932 0.0811245 -0.1350186 0.0331534 -0.1791716 0.339868 0.0313008 0.0435911 -0.3333427 -0.0702773 -0.0309279 0.0703441 0.000078 -0.0629357 1.8154226 -0.1957887 0.1710772 -0.2858516 0.7021873 -0.074088 0.2077665 -0.0731531 0.1566861 -0.0217954 -0.0136652 -0.0167825 -0.0458607 0.0290908 -0.1138432 -0.0427618 -0.0719641 -0.0690028 -0.0102638 0.0341192 -0.0056193 0.0816878 -0.1031407 0.0742221 0.004718 0.0451666 0.0755476 0.0578185 0.0689855 -0.0220186 0.0823871 -0.0225945 0.0268476 -0.0215866 0.0256301 0.1836899 0.1080473 -0.0390791 -0.0393808 -0.0108809 0.0107472 -0.112743 0.0096125 -0.0728293 -0.0842943 -0.2364112 -0.0393252 -0.0067007 -0.0483434 0.1038657 0.0143152 -0.0076629 0.0086608 0.073871 0.0748367 0.1116 -0.006713 0.0702569 -0.091699 0.0502969 0.0108426 0.0171633 0.0637609 0.065493 -0.0565346 -0.0065005 -0.0624508 0.0489249 0.0064868 -0.0094494 0.0071084 0.1875033 0.0526523 -0.072708 0.0000768 0.0727072 -0.2516043 0.038542 -0.0133605 0.0255098 0.107301 unknown
polarizability: 149.0778977|-0.5561361|92.615978|6.5552169|-5.4543892|48.6979697 unknown
InChI: InChI=1S/C7H8OS/c1-2-6-3-4-7(5-8)9-6/h3-5H,2H2,1H3
charge 0 multiplicity 1
17 atoms
S  0.2134 1.228076 0.028806
O  -3.631897 -0.009369 -0.26946
C  2.777184 -0.024421 0.41403
C  1.28771 -0.201407 0.273991
C  0.5421 -1.381674 0.301061
C  3.453312 0.621158 -0.824813
C  -1.243939 0.141241 -0.028003
C  -0.866853 -1.194701 0.133471
C  -2.581827 0.696067 -0.222512
H  3.002166 0.590103 1.308377
H  3.219412 -1.021329 0.599187
H  1.010893 -2.359204 0.440459
H  3.273717 0.017689 -1.731607
H  4.543984 0.699457 -0.668165
H  3.060846 1.637305 -1.009125
H  -1.607137 -1.997934 0.126605
H  -2.630269 1.807944 -0.330302
