program: Gaussian 09
title: 000169852
version: EM64L-G09RevD.01
frameworkgroup: C1[X(C16H10O8)]
method: RPBEPBE
basis: SDD
operation: Freq
keyword: #pfreq=noraman
keyword: PBEPBE/SDD
title: #p freq=noraman PBEPBE/SDD
converged: YES YES NO NO
title: Mulliken charges:
elementType: O O O O O O O O C C C C C C C C C C C C C C C C H H H H H H H H H H
charge: -0.140348 -0.140859 -0.436392 -0.436337 -0.185017 -0.185131 -0.228778 -0.228554 0.231254 0.230235 0.098525 0.099559 -0.330019 -0.329685 -0.315011 -0.315227 -0.210023 -0.210132 -0.212734 -0.212706 0.163004 0.163645 0.118384 0.118085 0.288411 0.288447 0.282138 0.282061 0.244628 0.244637 0.241643 0.241646 0.390361 0.390288
chargesum: 0.00000
title: Mulliken charges with hydrogens summed into heavy atoms:
elementType: O O O O O O O O C C C C C C C C C C C C C C C C
charge: -0.140348 -0.140859 -0.046031 -0.046050 -0.185017 -0.185131 -0.228778 -0.228554 0.231254 0.230235 0.098525 0.099559 -0.041608 -0.041237 -0.032873 -0.033166 0.034605 0.034505 0.028909 0.028940 0.163004 0.163645 0.118384 0.118085
polarizability: 3.11441961e+02 -2.00414178e+01 2.25616951e+02 -2.60265424e-01 -9.07908307e-03 1.05080118e+02
1716.lowfreq: -6.8828 -0.0006 -0.0001 0.0005 3.5310 5.5863 8.3898 21.9393 25.8630
frequency: 7.8068 21.8544 25.7578 28.9313 58.5706 62.4030 84.6177 92.9941 102.7641 134.2914 150.5642 159.4296 162.9881 215.4897 233.5475 240.2266 282.3836 305.1063 334.7038 339.1905 373.3575 388.8126 392.4750 413.9833 414.3913 499.2874 514.0117 531.3321 546.4110 590.2781 590.4241 595.0140 596.0067 631.6419 649.4980 674.7653 679.5135 689.1554 692.8691 724.1627 751.7322 754.1171 763.5120 770.2040 792.6420 794.9770 798.7966 803.7384 904.2179 904.3988 927.2138 934.5194 983.7604 983.8058 1007.8183 1007.9869 1009.5247 1009.6257 1039.6073 1039.8745 1106.8403 1109.3588 1164.6604 1164.8388 1181.1086 1181.1231 1195.4918 1200.8020 1281.3706 1281.7721 1324.5078 1324.8750 1382.9077 1383.5169 1426.6541 1426.8025 1478.9917 1480.5003 1581.5496 1581.6674 1598.0686 1598.2637 1642.4829 1643.0146 1674.8446 1697.0463 3142.6302 3142.6842 3156.7493 3156.9116 3170.5335 3170.6955 3184.5674 3184.6091 3531.4386 3531.5988
redmass: 6.8004 7.1462 10.2760 6.9215 11.5349 10.6885 12.6870 5.9741 5.0431 5.1233 6.5295 12.4040 9.2743 6.0947 6.4889 8.3108 9.8414 11.0737 7.0130 7.1708 11.0557 6.6276 6.1950 3.4871 3.3595 6.6485 6.8110 4.4286 4.3863 1.2807 1.2684 4.4865 4.8992 6.9028 6.3703 6.0366 6.4457 4.1718 4.4563 7.3033 5.1279 3.4969 3.2294 5.4218 2.6594 1.9079 3.2812 6.5765 1.5226 1.6037 4.5684 5.3183 1.4047 1.4097 4.1997 4.3146 1.4072 1.4860 2.3963 2.3900 1.9487 1.8901 1.8240 1.8194 1.0883 1.0920 2.8503 3.0104 1.4617 1.4627 2.6208 2.6249 10.3055 10.1600 2.1294 2.1350 2.6022 2.6059 7.2094 7.2446 6.1694 6.1427 9.0188 8.9752 12.7564 13.0533 1.0868 1.0868 1.0920 1.0920 1.0974 1.0974 1.0974 1.0974 1.0643 1.0643
irintensity: 0.2534 2.6636 0.5758 3.4313 0.7045 0.0008 0.7667 0.0109 0.2906 2.6038 1.2662 0.2862 0.4965 0.0160 8.0752 0.7041 1.9818 0.0617 17.9997 0.1285 21.2877 22.5802 0.9038 17.4027 2.6781 5.2884 9.5417 1.6312 2.7459 57.5227 141.7837 96.7634 0.0923 0.0977 15.5354 8.4123 47.9610 10.9802 134.5013 2.9189 20.3155 54.6364 33.3002 29.9263 34.7795 49.1405 51.8580 0.9541 8.2803 67.3640 407.0400 34.9940 2.3339 1.4131 261.6112 128.4423 1.1544 38.5945 11.3465 0.5975 276.0843 0.1041 128.8128 4.0541 0.2652 0.5171 143.6430 32.5768 5.2594 0.9827 157.3164 37.8282 32.3231 2.0329 2.0478 1.6459 13.0256 0.9659 31.6951 12.1342 41.7965 0.5244 279.2831 89.0906 218.5078 101.7216 3.2893 3.0990 6.9996 4.9787 13.1778 5.9121 14.8203 2.0530 77.9314 36.1696
temp: 298.150 k
press: 1.00000 atm
elementType: 8 8 8 8 8 8 8 8 6 6 6 6 6 6 6 6 6 6 6 6 6 6 6 6 1 1 1 1 1 1 1 1 1 1
symmnumber: 1
zpe: 602311.2 jmol-1
zpe.correction: 0.229408 hartree
zpe.thermalcorrener: 0.250757 hartree
zpe.thermalcorrenthalpy: 0.251701 hartree
zpe.thermalcorrgfe: 0.174703 hartree
zpe.sumelectzpe: -1215.758604 hartree
zpe.sumelectthermal: -1215.737256 hartree
zpe.sumelectthermalent: -1215.736312 hartree
zpe.sumelectthermalfe: -1215.813310 hartree
dipole: -0.0044 -0.0007 -0.8638
dipole: 0.8638
quadrupole: -82.3016 -117.7868 -142.5078
quadrupole: -7.4772 -0.0488 -0.0588
quadrupole: 31.8971 -3.5881 -28.3090 -7.4772 -0.0488 -0.0588
hfenergy: -1215.9880124 hartree
pointgroup: C01 [X(C16H10O8)]
dipole: -0.001234 0.3398345 -0.0003851 debye
polarizability: 315.4663158|-0.0145248|105.0797815|-6.3325399|0.009088|221.5929328 unknown
InChI: InChI=1S/C16H10O8/c17-13(18)9-5-1-3-7-11(9)15(21)23-24-16(22)12-8-4-2-6-10(12)14(19)20/h1-8,17,19H
charge 0 multiplicity 1
34 atoms
O  -0.750976 -0.947599 0.161979
O  0.743937 -0.949447 -0.173681
O  -5.093614 -0.579661 -2.79932
O  5.087779 -0.583184 2.804064
O  -0.879056 0.86687 -1.359612
O  0.88015 0.848717 1.366603
O  -2.830724 -1.074225 -2.632044
O  2.830036 -1.09805 2.628317
C  -2.80559 0.170443 0.034809
C  2.803505 0.158292 -0.035113
C  -3.983529 -0.065012 -0.729945
C  3.980693 -0.076344 0.731253
C  -2.908438 0.592698 1.381753
C  2.9080 0.580698 -1.381926
C  -5.251594 0.160942 -0.140513
C  5.249281 0.150672 0.14345
C  -4.179288 0.805481 1.960934
C  4.179431 0.794182 -1.959553
C  -5.350561 0.597453 1.197584
C  5.349773 0.587104 -1.194613
C  -1.417346 0.105799 -0.546097
C  1.415084 0.094198 0.544789
C  -3.871939 -0.610901 -2.111479
C  3.868672 -0.624532 2.112003
H  -1.993314 0.761293 1.958343
H  1.993494 0.749622 -1.959356
H  -6.14729 -0.022085 -0.739521
H  6.144356 -0.031595 0.743619
H  -4.250384 1.133374 3.003139
H  4.251632 1.122189 -3.001641
H  -6.335737 0.76472 1.644926
H  6.335465 0.75504 -1.640573
H  -4.961266 -0.970652 -3.704283
H  4.955855 -0.976698 3.708005
