program: Gaussian 09
title: 000169822
version: EM64L-G09RevD.01
frameworkgroup: C1[X(C11H20N2O3)]
method: RPBEPBE
basis: SDD
operation: Freq
keyword: #p
keyword: freq=noraman
keyword: PBEPBE/SDD
title: #p freq=noraman PBEPBE/SDD
converged: YES YES NO NO
title: Mulliken charges:
elementType: O O O N N C C C C C C C C C C C H H H H H H H H H H H H H H H H H H H H
charge: -0.276837 -0.419324 -0.232947 -0.415202 -0.389387 -0.061460 -0.096289 -0.396496 -0.383205 -0.390470 -0.401508 -0.700723 0.167253 -0.133634 -0.713580 0.161142 0.218272 0.226217 0.189841 0.224886 0.200562 0.188943 0.187652 0.229087 0.316169 0.310941 0.224006 0.195984 0.237298 0.217714 0.213394 0.237939 0.223002 0.226501 0.239417 0.374843
chargesum: 0.00000
title: Mulliken charges with hydrogens summed into heavy atoms:
elementType: O O O N N C C C C C C C C C C C
charge: -0.276837 -0.044481 -0.232947 -0.099033 -0.078446 0.156812 0.129928 0.018231 0.006300 0.026269 0.018481 -0.032318 0.167253 0.104305 -0.024660 0.161142
polarizability: 1.61111705e+02 7.88752620e+00 1.36444981e+02 2.74041586e+00 -3.62444938e+00 1.19927010e+02
1716.lowfreq: -7.9392 0.0005 0.0009 0.0010 3.6394 5.7895 16.2093 23.3679 29.3151
frequency: 16.0640 23.2789 29.3115 49.4087 58.6335 89.5556 102.0240 111.5079 138.8654 149.2837 183.7897 214.1375 236.7335 237.6229 266.1851 275.7593 293.8871 367.5551 396.9079 400.9086 440.3964 468.2059 483.7011 508.8328 537.7637 575.3416 606.0864 663.6938 698.7039 708.1463 711.8204 727.0513 752.2794 791.3701 839.3518 898.3392 924.5780 930.2442 959.5265 984.4203 1006.7560 1013.9075 1022.9342 1038.1211 1047.8750 1059.0799 1076.8444 1087.6275 1103.6020 1120.2669 1137.7862 1145.9140 1171.3618 1216.3004 1237.7122 1241.1237 1248.3653 1258.3421 1273.9876 1291.6647 1297.1083 1300.4286 1321.1399 1339.8737 1344.4497 1352.6922 1358.4946 1362.4674 1375.4837 1388.4419 1389.6379 1390.0331 1449.9683 1454.7090 1462.7647 1468.4218 1472.8528 1474.2006 1478.3519 1483.4946 1660.0371 1691.2719 2949.7450 2959.2325 2963.1292 2974.6480 2977.0557 2978.3081 2987.2321 2992.6961 2997.5210 3007.6082 3021.2149 3037.4457 3052.3532 3072.8562 3086.5610 3087.0682 3096.4258 3507.8102 3615.0202 3624.1982
redmass: 5.0755 5.2049 8.9855 4.5970 3.8288 2.9129 2.0154 4.4379 3.8003 2.2513 3.1663 1.1162 3.6057 1.0876 3.1047 2.7653 2.5369 2.9199 2.4504 1.7659 3.5362 1.2070 2.7583 3.2031 2.7024 3.2638 1.2562 4.4474 3.6246 4.6791 3.2849 1.3956 1.9275 1.6796 2.2479 1.8200 1.8730 1.8252 3.4040 1.9949 3.5735 2.0950 1.5284 2.5901 2.0330 2.7127 2.4221 2.4199 1.6851 1.9286 1.9732 1.9013 1.7992 1.2973 1.4768 1.5185 1.9317 1.4238 1.3689 1.2004 1.2365 1.1658 1.3315 1.4761 1.3186 1.4439 1.5507 1.6903 1.5572 1.3844 1.2570 2.2720 1.0836 1.0778 1.0806 1.0578 1.0499 1.0471 1.0973 1.0633 8.1842 7.4547 1.0593 1.0616 1.0630 1.0610 1.0592 1.0609 1.0353 1.0859 1.0933 1.0856 1.0976 1.1024 1.1035 1.0994 1.1007 1.1004 1.1006 1.0639 1.0788 1.0797
irintensity: 0.6028 0.5555 0.9509 1.9417 0.1412 1.1178 0.2526 2.6472 0.8443 2.1900 0.9925 0.1820 0.5124 0.0524 0.5899 2.1637 1.9710 24.5686 7.5187 6.2520 10.4953 252.9647 24.0550 40.7601 2.5522 7.7061 118.2368 7.3595 15.1134 11.1102 32.6085 25.2132 0.8809 2.5101 1.0283 0.1603 0.6246 1.3087 5.1581 0.8013 11.0858 54.4357 13.5372 251.8876 12.1866 22.9958 6.5262 4.3145 4.9505 8.6580 5.0648 26.1714 5.7623 24.6143 4.5226 29.6839 81.3859 15.4365 20.9707 4.4483 26.0896 1.1322 3.2267 5.1080 14.5422 10.9053 5.6907 13.6137 16.0968 6.8068 8.4440 133.6329 5.2378 1.0638 0.2887 6.2474 6.7859 14.4361 13.6686 17.6364 182.0836 599.6199 13.0201 0.6348 47.5102 8.9814 43.5770 35.8432 32.5426 40.9093 14.1991 9.8125 2.6523 27.0986 85.4366 38.5446 31.8822 34.5474 26.6153 20.0334 45.0780 20.8888
temp: 298.150 k
press: 1.00000 atm
elementType: 8 8 8 7 7 6 6 6 6 6 6 6 6 6 6 6 1 1 1 1 1 1 1 1 1 1 1 1 1 1 1 1 1 1 1 1
symmnumber: 1
zpe: 801230.6 jmol-1
zpe.correction: 0.305173 hartree
zpe.thermalcorrener: 0.323438 hartree
zpe.thermalcorrenthalpy: 0.324382 hartree
zpe.thermalcorrgfe: 0.255609 hartree
zpe.sumelectzpe: -765.109654 hartree
zpe.sumelectthermal: -765.091389 hartree
zpe.sumelectthermalent: -765.090445 hartree
zpe.sumelectthermalfe: -765.159218 hartree
dipole: -2.4520 -5.8658 1.6326
dipole: 6.5640
quadrupole: -97.1703 -109.7866 -92.1016
quadrupole: -17.0378 9.4424 6.3368
quadrupole: 2.5158 -10.1004 7.5846 -17.0378 9.4424 6.3368
hfenergy: -765.4148269 hartree
pointgroup: C01 [X(C11H20N2O3)]
dipole: -0.9893622 2.3464394 -0.4296065 debye
polarizability: 161.1837151|-7.4198415|136.8163304|-3.7600903|-2.0970916|119.4836506 unknown
InChI: InChI=1S/C11H20N2O3/c1-7(10(14)15)5-3-4-6-9-8(2)12-11(16)13-9/h7-9,12-14H,3-6H2,1-2H3
charge 0 multiplicity 1
36 atoms
O  4.150097 -2.445038 0.514431
O  -5.266816 -0.393574 -1.551535
O  -3.768604 -1.785484 -0.457967
N  2.831842 -0.499673 0.930173
N  4.160655 -0.498427 -0.866549
C  2.478792 0.755296 0.239796
C  3.650876 0.885509 -0.808963
C  1.079468 0.722926 -0.423554
C  -0.080529 0.593307 0.588171
C  -1.470789 0.631954 -0.085327
C  -2.627948 0.517961 0.932141
C  4.730909 1.902172 -0.379025
C  3.75845 -1.281334 0.225819
C  -4.033978 0.573792 0.291037
C  -5.158488 0.66668 1.363495
C  -4.291987 -0.655011 -0.572986
H  2.518985 1.608652 0.946766
H  3.231995 1.184437 -1.789279
H  0.953019 1.66071 -1.004454
H  1.046095 -0.115365 -1.147763
H  0.015729 -0.360265 1.146992
H  -0.010195 1.411029 1.337104
H  -1.573552 1.576406 -0.660161
H  -1.540895 -0.19825 -0.815393
H  2.305197 -0.896043 1.7043
H  4.943521 -0.790838 -1.446746
H  -2.530515 -0.431693 1.493554
H  -2.553182 1.342129 1.66991
H  5.130014 1.64015 0.617289
H  5.572303 1.916278 -1.096315
H  4.307118 2.922833 -0.331707
H  -4.114747 1.459236 -0.368692
H  -5.021289 1.582288 1.965737
H  -5.121328 -0.202343 2.045115
H  -6.156864 0.704612 0.895008
H  -5.441058 -1.227018 -2.068523
