program: Gaussian 09
title: 000169827
version: EM64L-G09RevD.01
frameworkgroup: C1[X(C11H11F13OS)]
method: RPBEPBE
basis: SDD
operation: Freq
keyword: #p
keyword: freq=noraman
keyword: PBEPBE/SDD
title: #p freq=noraman PBEPBE/SDD
converged: NO YES NO NO
title: Mulliken charges:
elementType: S F F F F F F F F F F F F F O C C C C C C C C C C C H H H H H H H H H H H
charge: 0.196843 -0.137722 -0.127985 -0.125729 -0.133601 -0.166529 -0.162290 -0.130856 -0.118550 -0.125098 -0.115560 -0.121445 -0.123574 -0.124209 -0.449535 0.221181 0.251158 0.308638 0.252320 -0.426247 0.207933 -0.713436 0.372589 -0.648222 -0.339470 -0.307141 0.266990 0.271108 0.275722 0.288945 0.250421 0.242266 0.237331 0.234697 0.187009 0.186166 0.345883
chargesum: 0.00000
title: Mulliken charges with hydrogens summed into heavy atoms:
elementType: S F F F F F F F F F F F F F O C C C C C C C C C C C
charge: 0.196843 -0.137722 -0.127985 -0.125729 -0.133601 -0.166529 -0.162290 -0.130856 -0.118550 -0.125098 -0.115560 -0.121445 -0.123574 -0.124209 -0.103652 0.221181 0.251158 0.308638 0.252320 0.111852 0.207933 -0.148769 0.372589 -0.155535 0.132557 0.066034
polarizability: 1.89709608e+02 -8.61801028e+00 1.32513350e+02 1.02932235e+01 9.61242743e-01 1.24886491e+02
1716.lowfreq: -4.6385 -2.1231 -0.0020 -0.0019 -0.0008 5.3578 10.0784 15.5745 21.5779
frequency: 8.8760 15.5444 21.5202 34.4701 35.4130 44.8699 60.8959 73.8096 84.2411 96.1690 105.7669 108.1600 109.1809 127.8454 134.3165 144.2025 169.3421 178.5221 195.7297 212.0218 234.8156 241.6090 251.6802 256.0849 267.9683 271.9290 283.0873 284.0358 297.9041 302.3262 309.3124 314.0831 323.0786 326.5869 333.8727 380.8318 408.8375 422.5229 441.5316 443.7042 463.0554 509.3286 522.1922 552.0970 562.6652 583.8218 587.6335 650.6503 658.5080 696.1047 755.2899 760.4389 779.9059 819.3113 858.8393 874.2614 894.5125 935.6905 972.6376 978.6720 993.7665 1001.9667 1013.1059 1025.7022 1035.5865 1038.0711 1040.6296 1047.1261 1057.8070 1069.4657 1077.4131 1082.7852 1114.0818 1132.1298 1145.2819 1156.9868 1158.3947 1170.8526 1189.7947 1193.8097 1208.0467 1250.8648 1260.3909 1264.6703 1285.9922 1304.0829 1335.4252 1349.9389 1415.8632 1439.2111 1452.0050 1457.6602 1474.7755 1488.8387 2929.5985 2977.3303 2995.5455 3012.9749 3031.3354 3041.8023 3056.7147 3085.4872 3092.0637 3119.0740 3570.7225
redmass: 8.2310 4.9885 2.6262 7.3416 13.2252 14.2951 12.9302 8.5794 3.0825 4.5187 9.6098 9.1066 3.1452 3.7596 16.9954 11.7556 9.1888 5.2206 16.4039 12.9937 10.2271 12.7837 10.4152 13.8665 6.9170 1.0917 14.5221 17.6509 16.8766 12.0730 9.1828 9.9074 9.7392 8.7417 10.2640 7.8646 10.7024 12.8122 4.7250 8.6675 17.6908 13.2941 12.3004 16.1740 15.7365 16.6338 17.5209 11.8985 11.1774 4.8541 4.3556 1.3993 1.0981 12.6075 1.2036 11.1971 2.9664 9.9175 12.6021 6.3420 8.8166 2.9729 8.1900 12.2463 1.6265 12.1051 5.0867 1.7638 5.5889 2.8982 10.7149 11.6285 12.0394 11.1958 10.5916 6.9227 1.3325 4.7890 10.2437 1.3437 1.2179 1.2488 1.2485 1.2533 1.0936 1.1391 1.3674 1.4280 1.4305 1.0724 1.0944 1.0875 1.0752 1.0865 1.0543 1.1072 1.0560 1.0588 1.0608 1.0582 1.1058 1.1069 1.1018 1.1065 1.0665
irintensity: 0.0985 1.9925 6.3579 1.4017 0.5037 0.1218 0.3141 1.8137 0.8423 0.8672 0.2768 1.4266 4.3050 0.2245 1.1964 0.9757 0.7326 0.3153 16.1667 13.0086 1.9949 0.4700 1.3465 0.6157 5.8389 160.8117 1.6142 0.8061 0.3198 0.8272 1.9575 1.3094 1.4893 0.2514 0.4132 4.9599 6.8766 4.7241 17.0187 4.6027 9.1491 5.3675 3.6435 3.5866 9.9076 3.6272 1.4659 83.4457 0.2721 17.1771 10.0175 0.4914 6.4680 222.8647 0.4363 56.3757 70.2377 103.7221 18.2090 89.9981 27.0640 24.8836 167.1226 62.1823 7.0742 82.0746 38.4268 3.5294 57.4337 7.2211 220.8289 340.4182 31.1005 86.2047 25.0702 4.9233 1.3566 19.9604 45.5635 28.0963 12.2269 27.4802 2.9377 4.9730 2.0344 7.3941 20.9527 41.9220 8.0024 0.2434 21.0564 8.3079 3.6961 5.0263 64.9036 58.4967 21.0488 24.4799 3.7714 13.6660 0.8741 50.5768 0.5133 3.9863 3.2163
temp: 298.150 k
press: 1.00000 atm
elementType: 16 9 9 9 9 9 9 9 9 9 9 9 9 9 8 6 6 6 6 6 6 6 6 6 6 6 1 1 1 1 1 1 1 1 1 1 1
symmnumber: 1
zpe: 582686.0 jmol-1
zpe.correction: 0.221933 hartree
zpe.thermalcorrener: 0.250783 hartree
zpe.thermalcorrenthalpy: 0.251727 hartree
zpe.thermalcorrgfe: 0.158047 hartree
zpe.sumelectzpe: -2194.889950 hartree
zpe.sumelectthermal: -2194.861101 hartree
zpe.sumelectthermalent: -2194.860157 hartree
zpe.sumelectthermalfe: -2194.953836 hartree
dipole: -2.6065 2.2401 0.4079
dipole: 3.4609
quadrupole: -150.9091 -158.8656 -164.0765
quadrupole: -20.8203 -8.8912 -3.0352
quadrupole: 7.0413 -0.9152 -6.1261 -20.8203 -8.8912 -3.0352
hfenergy: -2195.1118838 hartree
pointgroup: C01 [X(C11H11F13O1S1)]
dipole: 1.0359903 0.8059154 -0.3622983 debye
polarizability: 190.0723435|9.8845573|131.3808348|7.7571202|-2.7180308|125.6562712 unknown
InChI: InChI=1S/C11H11F13OS/c12-6(13,2-5-26-4-1-3-25)7(14,15)8(16,17)9(18,19)10(20,21)11(22,23)24/h25H,1-5H2
charge 0 multiplicity 1
37 atoms
S  4.226733 -1.719882 0.412095
F  0.243398 2.012815 -1.197506
F  -1.490932 0.72194 -1.94318
F  -1.946989 2.090299 0.386565
F  -0.073483 1.214557 1.358144
F  1.01538 -0.157152 -2.602602
F  -0.155092 -1.598422 -1.275501
F  -1.116933 -1.324578 1.275302
F  -2.333518 0.256942 2.378157
F  -3.794151 -1.738722 1.298528
F  -2.96604 -1.391625 -0.800666
F  -5.618939 -0.483469 -0.193404
F  -4.75642 1.034414 1.253618
F  -4.176252 1.09042 -0.943554
O  8.726616 0.808519 1.01668
C  -0.451651 0.787527 -0.987029
C  -1.119477 0.942256 0.434098
C  0.579634 -0.369142 -1.252011
C  -1.972796 -0.210118 1.091161
C  1.781615 -0.465768 -0.32242
C  -3.291907 -0.754926 0.413539
C  2.776716 -1.555143 -0.780032
C  -4.473201 0.249041 0.1321
C  5.258345 -0.218872 -0.127897
C  6.601945 -0.243565 0.620798
C  7.487856 0.949052 0.236239
H  2.27519 0.521822 -0.292009
H  1.43538 -0.694516 0.699496
H  3.174047 -1.346359 -1.786406
H  2.297535 -2.547496 -0.792316
H  5.403858 -0.29294 -1.221123
H  4.694061 0.703048 0.10245
H  7.14749 -1.177976 0.39467
H  6.433423 -0.217509 1.71341
H  7.700408 0.931898 -0.85549
H  6.971613 1.904418 0.477979
H  9.341738 1.554211 0.802315
