program: Gaussian 09
title: 000169780
version: EM64L-G09RevD.01
frameworkgroup: C1[X(C16H20)]
method: RPBEPBE
basis: SDD
operation: Freq
keyword: #p
keyword: freq=noraman
keyword: PBEPBE/SDD
title: #p freq=noraman PBEPBE/SDD
converged: YES YES NO NO
title: Mulliken charges:
elementType: C C C C C C C C C C C C C C C C H H H H H H H H H H H H H H H H H H H H
charge: -0.394130 -0.352486 -0.596701 -0.356735 0.427532 -0.355524 0.175524 0.394433 -0.460918 -0.695903 -0.387838 -0.462135 -0.244845 -0.438011 -0.270144 -0.244794 0.219622 0.211892 0.188689 0.186892 0.210297 0.216470 0.189947 0.190024 0.194681 0.195015 0.234653 0.215437 0.210254 0.210244 0.238975 0.237426 0.223901 0.236147 0.225016 0.227091
chargesum: 0.00000
title: Mulliken charges with hydrogens summed into heavy atoms:
elementType: C C C C C C C C C C C C C C C C
charge: 0.037384 0.023096 -0.169933 0.023236 0.427532 0.034172 0.175524 0.394433 -0.226264 -0.059967 -0.148863 -0.224708 -0.020944 -0.201864 -0.045128 -0.017703
polarizability: 2.08438665e+02 7.71457993e+00 2.03239913e+02 -2.35831910e+01 5.83495476e+00 1.09543616e+02
1716.lowfreq: -32.7400 -8.6036 -5.7961 -0.0005 -0.0005 0.0007 15.6389 26.6001 42.1025
frequency: -24.0719 26.3805 42.0625 73.0933 106.6732 111.6394 136.2476 161.5928 179.4725 224.2426 229.9708 266.3788 293.0567 383.6168 420.5189 430.2677 439.5440 473.4588 500.5692 509.7133 562.6563 599.8456 655.0305 704.9274 721.6717 738.4524 744.8899 781.0949 791.0705 792.7015 813.2793 857.2375 877.2382 880.3961 888.2371 916.2597 959.2714 971.6404 982.1505 990.5702 1003.9548 1011.2150 1018.3408 1034.2433 1062.3081 1077.4493 1079.5751 1107.8199 1114.3298 1150.6021 1172.9680 1180.9316 1190.8779 1224.5493 1233.7444 1240.9532 1248.3226 1267.4587 1278.3152 1284.2817 1286.3255 1292.5826 1322.8568 1344.9076 1351.7407 1379.2285 1386.1689 1405.6736 1416.3523 1441.6853 1455.2218 1461.3560 1463.7911 1471.6260 1475.8035 1478.1438 1486.0502 1492.8543 1517.5120 1589.5700 1598.2310 1632.4675 2948.1367 2954.2790 2965.9098 2971.2295 2972.0233 2981.6521 2985.1693 3001.1101 3017.6990 3029.9253 3048.7885 3067.4616 3070.8366 3116.4773 3119.5212 3126.6671 3130.1085 3147.0369 3153.3093 3162.1804
redmass: 1.7399 3.2024 3.9651 2.9700 2.9556 1.9056 2.2455 3.7854 3.9862 1.1567 3.3910 3.3155 2.8767 3.3265 3.2467 3.1235 2.9939 3.2477 5.6660 5.3304 3.7059 4.1987 3.5122 4.2078 1.0655 1.1193 1.2724 2.3663 2.0175 1.5481 1.6202 2.5417 1.7083 1.6020 1.9193 1.4462 1.3789 1.3226 1.3584 1.3533 3.9587 3.2597 2.8359 2.0058 2.7739 2.2462 2.3984 1.4946 2.2580 1.4309 1.1178 1.2160 1.6630 1.2904 1.6315 1.6092 1.5436 1.4618 1.1763 1.2206 1.3455 1.1093 1.4297 1.4936 1.6599 2.1323 1.2160 2.9389 5.2995 2.4022 2.5510 1.0701 1.0759 1.0754 1.0439 1.0839 1.0839 1.1181 3.6291 7.5942 5.2844 6.5555 1.0587 1.0587 1.0590 1.0384 1.0571 1.0596 1.0973 1.1004 1.1010 1.1040 1.1043 1.1007 1.0993 1.0863 1.0857 1.0908 1.0883 1.0943 1.0993 1.1001
irintensity: 0.0041 0.0024 0.0451 0.0410 0.0847 0.0276 0.0501 0.5746 1.9226 0.0016 0.1519 2.9722 0.5979 0.3473 0.2235 4.3365 8.2644 0.3609 0.7358 1.1214 3.8797 2.9134 0.5885 0.7515 10.9152 0.6605 2.8999 3.3931 74.1592 10.9037 51.8580 0.6890 1.1272 4.3440 4.6845 0.3851 1.6897 0.3447 2.2783 0.9667 0.7573 0.5676 7.5537 2.5579 0.4732 3.0508 5.1414 1.6569 18.4680 1.7997 1.9034 0.7020 0.3945 6.9110 1.2367 4.3457 1.0626 1.7948 0.7347 0.8582 1.6340 0.3686 0.6441 0.7290 1.0464 10.1519 10.9499 4.9364 4.5061 3.0090 1.6617 0.0382 0.5303 0.3976 12.2932 1.6935 9.5463 20.8256 9.5635 4.2751 8.3050 0.3299 6.8316 10.9897 71.0607 28.9678 13.5711 90.2407 1.1856 1.1226 3.8210 22.1881 83.0990 92.7806 56.2306 6.1398 1.1711 18.8996 6.2367 40.3402 43.8145 25.0380
temp: 298.150 k
press: 1.00000 atm
elementType: 6 6 6 6 6 6 6 6 6 6 6 6 6 6 6 6 1 1 1 1 1 1 1 1 1 1 1 1 1 1 1 1 1 1 1 1
symmnumber: 1
zpe: 819077.3 jmol-1
zpe.correction: 0.311970 hartree
zpe.thermalcorrener: 0.326670 hartree
zpe.thermalcorrenthalpy: 0.327614 hartree
zpe.thermalcorrgfe: 0.268987 hartree
zpe.sumelectzpe: -620.537814 hartree
zpe.sumelectthermal: -620.523114 hartree
zpe.sumelectthermalent: -620.522170 hartree
zpe.sumelectthermalfe: -620.580796 hartree
dipole: -0.5807 -0.0071 0.0405
dipole: 0.5821
quadrupole: -92.8236 -89.2410 -101.3388
quadrupole: 1.1884 -5.1950 1.4876
quadrupole: 1.6442 5.2268 -6.8710 1.1884 -5.1950 1.4876
hfenergy: -620.8497837 hartree
pointgroup: C01 [X(C16H20)]
dipole: 0.2284298 -0.004659 0.0158565 debye
polarizability: 208.8500315|6.2743011|203.2294519|23.84212|-1.431015|109.1427102 unknown
InChI: InChI=1S/C16H20/c1-2-3-4-5-9-14-11-8-12-15-10-6-7-13-16(14)15/h6-8,10-13H,2-5,9H2,1H3
charge 0 multiplicity 1
36 atoms
C  1.749158 0.398559 0.026632
C  3.159519 0.173181 0.614881
C  0.705446 0.80079 1.108247
C  4.215272 -0.183809 -0.4556
C  -0.692894 1.009406 0.544976
C  5.62631 -0.416403 0.13174
C  -1.563962 -0.107971 0.245217
C  -2.871539 0.144227 -0.333616
C  -1.145125 2.308551 0.273661
C  6.678436 -0.759199 -0.944898
C  -1.191078 -1.47177 0.501999
C  -3.280717 1.492583 -0.599083
C  -2.43106 2.556766 -0.298114
C  -3.736311 -0.962081 -0.629207
C  -2.055068 -2.528985 0.205954
C  -3.340632 -2.274605 -0.367543
H  1.411245 -0.519931 -0.493142
H  1.789066 1.193602 -0.744776
H  3.482343 1.087313 1.156697
H  3.117369 -0.637253 1.373204
H  0.702169 0.029588 1.903815
H  1.047024 1.738355 1.587681
H  4.262671 0.629541 -1.209649
H  3.892563 -1.094471 -1.002559
H  5.944054 0.490964 0.685292
H  5.579022 -1.234923 0.879028
H  -0.492172 3.158735 0.506383
H  7.677471 -0.920676 -0.499629
H  6.400015 -1.679237 -1.493018
H  6.766607 0.057377 -1.68631
H  -0.212983 -1.687406 0.944172
H  -4.269574 1.671809 -1.037949
H  -2.744004 3.588097 -0.495318
H  -4.721357 -0.756216 -1.065618
H  -1.75046 -3.560872 0.413727
H  -4.009524 -3.111638 -0.596276
