program: Gaussian 09
title: 000169741
version: EM64L-G09RevD.01
frameworkgroup: C1[X(C11H13N3O4)]
method: RPBEPBE
basis: SDD
operation: Freq
keyword: #p
keyword: freq=noraman
keyword: PBEPBE/SDD
title: #p freq=noraman PBEPBE/SDD
converged: YES YES NO NO
title: Mulliken charges:
elementType: O O O O N N N C C C C C C C C C C C H H H H H H H H H H H H H
charge: -0.239224 -0.324737 -0.220658 -0.217756 -0.365923 -0.453788 0.019385 -0.223493 0.211178 -0.726285 0.488465 -0.426186 -0.322874 0.304471 0.391290 -0.343228 -0.362826 -0.759524 0.282478 0.251163 0.237287 0.225180 0.321283 0.371781 0.257233 0.311942 0.286356 0.285080 0.262489 0.261673 0.217769
chargesum: 0.00000
title: Mulliken charges with hydrogens summed into heavy atoms:
elementType: O O O O N N N C C C C C C C C C C C
charge: -0.239224 -0.324737 -0.220658 -0.217756 -0.044640 -0.082007 0.019385 0.058985 0.211178 -0.012655 0.488465 -0.168953 -0.010932 0.304471 0.391290 -0.056872 -0.077747 -0.017593
polarizability: 2.65645597e+02 -1.57217247e+01 1.64129168e+02 -2.53908474e+00 -1.62221403e+01 9.04055707e+01
1716.lowfreq: -1.8454 -0.0004 -0.0002 0.0003 5.1180 5.9114 32.7797 37.0950 68.0072
frequency: 32.6996 37.0024 68.0014 73.9479 83.2658 92.0136 98.3001 131.8631 161.9808 178.6276 194.5141 213.2227 221.6397 271.7974 309.8575 337.7042 344.6694 380.2634 417.1212 425.0025 456.8657 507.7062 512.4369 558.3999 574.6334 606.4657 620.5948 632.3920 663.1055 669.3244 739.2112 750.5417 772.6394 829.6137 838.2970 868.8803 879.2029 891.2069 945.4981 959.3648 988.2240 1000.0670 1006.4555 1009.0429 1039.4337 1046.5802 1096.0470 1113.9421 1119.9298 1138.2892 1177.5473 1187.9776 1225.8340 1261.8804 1287.0243 1298.6351 1317.3388 1331.9012 1354.4323 1393.9465 1395.6093 1399.7186 1433.0768 1448.0252 1459.1228 1462.0199 1474.0932 1486.7201 1489.7711 1550.4800 1575.6839 1598.2475 1617.5661 1654.0197 3001.2712 3001.7097 3002.0598 3099.6337 3100.2220 3107.8136 3113.8222 3140.6463 3147.0666 3177.3865 3185.5025 3200.1763 3545.4338
redmass: 5.3488 5.4331 8.5844 4.3586 4.9191 3.2944 1.3633 5.7440 2.7317 2.8994 1.6364 5.5265 4.3259 4.4752 4.6142 6.0609 5.6539 6.1778 3.0407 3.5612 4.0828 5.9765 3.5663 2.0673 2.5614 2.1192 5.9487 6.4971 4.5610 4.7244 4.7239 5.6444 7.2758 4.6394 1.3880 2.8841 1.6241 2.3856 1.4496 2.4340 1.3354 3.1065 1.4946 1.3291 1.6868 1.6389 3.1835 1.8510 1.7551 2.7110 1.5573 2.3673 4.5555 1.5658 2.1017 1.4891 1.9142 1.3129 7.3239 1.3583 4.2443 1.2381 4.6074 1.0458 1.2041 1.1173 1.0711 1.7780 2.5636 2.6827 5.3693 6.7488 5.4170 2.4127 1.0789 1.0364 1.0413 1.1010 1.0978 1.1013 1.0988 1.0910 1.0859 1.0904 1.0948 1.0961 1.0786
irintensity: 0.7611 0.5175 5.4010 0.3309 3.6016 7.4658 1.8321 12.7850 0.3711 10.2528 1.6678 7.5441 1.2577 11.4535 7.0462 0.6144 1.5597 11.5106 0.7874 14.0397 2.5270 2.9759 8.2646 44.4729 71.4579 10.0298 1.4845 1.8436 3.3100 24.2124 4.6312 15.8678 13.7022 1.7104 2.4245 3.6098 61.3823 10.8400 107.3847 30.1749 4.4194 0.0587 1.5522 0.1941 17.4606 10.3892 20.6311 21.8860 18.0440 45.5298 279.9835 15.1143 469.8989 27.7415 46.0993 38.5621 13.8260 5.9963 85.3945 47.4820 117.5742 51.9981 31.3145 19.1191 79.9644 53.5600 27.6875 84.3052 46.9179 657.2951 86.1522 216.0974 77.4562 138.8983 3.5934 4.9145 24.7221 16.3734 6.7596 21.8383 11.1482 0.3440 594.4916 2.0490 2.9318 2.4647 26.1964
temp: 298.150 k
press: 1.00000 atm
elementType: 8 8 8 8 7 7 7 6 6 6 6 6 6 6 6 6 6 6 1 1 1 1 1 1 1 1 1 1 1 1 1
symmnumber: 1
zpe: 619733.2 jmol-1
zpe.correction: 0.236044 hartree
zpe.thermalcorrener: 0.253425 hartree
zpe.thermalcorrenthalpy: 0.254370 hartree
zpe.thermalcorrgfe: 0.189404 hartree
zpe.sumelectzpe: -890.758406 hartree
zpe.sumelectthermal: -890.741025 hartree
zpe.sumelectthermalent: -890.740080 hartree
zpe.sumelectthermalfe: -890.805046 hartree
dipole: 10.6579 0.9795 0.7304
dipole: 10.7277
quadrupole: -117.9633 -108.2634 -103.1695
quadrupole: 4.0538 9.1218 5.4890
quadrupole: -8.1645 1.5353 6.6292 4.0538 9.1218 5.4890
hfenergy: -890.9944501 hartree
pointgroup: C01 [X(C11H13N3O4)]
dipole: -4.2192593 -0.077047 -0.0729955 debye
polarizability: 259.0849637|29.5668497|102.7348528|14.1261273|30.0638852|158.3605192 unknown
InChI: InChI=1S/C11H13N3O4/c1-7(12-8(2)15)11(16)13-9-3-5-10(6-4-9)14(17)18/h3-7,12-13H,1-2H3
charge 0 multiplicity 1
31 atoms
O  -1.204862 -1.244405 -2.285513
O  -2.869662 -0.016482 1.775858
O  5.069614 1.146829 1.497733
O  5.37192 0.678148 -0.716023
N  -3.823985 -0.141017 -0.330133
N  -0.85972 -0.707433 -0.011438
N  4.633372 0.753719 0.343816
C  -3.113095 -1.391146 -0.706645
C  -1.628168 -1.105604 -1.101882
C  -3.856664 -2.100285 -1.845037
C  0.506981 -0.355538 0.014456
C  1.037503 0.086159 1.26317
C  1.356035 -0.426888 -1.128531
C  -3.702153 0.438701 0.91386
C  3.213611 0.371694 0.231816
C  2.386328 0.449241 1.376775
C  2.708199 -0.062717 -1.014209
C  -4.595281 1.629382 1.21348
H  -3.09824 -2.024116 0.20255
H  -3.362158 -3.056204 -2.080554
H  -3.835425 -1.495316 -2.768317
H  -4.902078 -2.305291 -1.555236
H  -4.446881 0.273523 -1.026496
H  -1.402836 -0.582621 0.872605
H  0.380725 0.142536 2.13861
H  0.943004 -0.762467 -2.080872
H  2.811136 0.790146 2.324178
H  3.380091 -0.108729 -1.875303
H  -5.230864 1.390125 2.083625
H  -3.969427 2.492674 1.496501
H  -5.243015 1.915582 0.367855
