program: Gaussian 09
title: 000169731
version: EM64L-G09RevD.01
frameworkgroup: C1[X(C10H8N2)]
method: RPBEPBE
basis: SDD
operation: Freq
keyword: #pfreq=noraman
keyword: PBEPBE/SDD
title: #p freq=noraman PBEPBE/SDD
converged: NO YES NO NO
title: Mulliken charges:
elementType: N N C C C C C C C C C C H H H H H H H H
charge: -0.488475 -0.007386 0.210017 0.291500 0.443401 -0.545577 -0.357601 -0.414171 -0.567569 -0.214924 -0.248091 -0.151935 0.326480 0.260266 0.233886 0.238185 0.271707 0.274736 0.223207 0.222344
chargesum: 0.00000
title: Mulliken charges with hydrogens summed into heavy atoms:
elementType: N N C C C C C C C C C C
charge: -0.161995 -0.007386 0.210017 0.291500 0.443401 -0.285311 -0.123715 -0.175987 -0.021126 0.008283 -0.025746 -0.151935
polarizability: 1.72321451e+02 -7.47801363e-02 1.17530966e+02 4.31079904e+00 -1.48571873e+00 5.52053023e+01
1716.lowfreq: -9.0042 -0.0006 -0.0005 -0.0001 4.3918 6.7086 25.1499 78.7400 145.8062
frequency: 25.0065 78.7389 145.8049 241.0763 245.1744 299.6646 354.0794 406.1822 429.2466 450.5655 540.3448 555.6751 574.5141 603.7317 619.3468 701.4394 745.0831 755.4743 802.8652 815.5744 856.4845 877.9333 922.4366 927.4013 934.9858 973.4446 980.6491 1012.9928 1114.5679 1141.2500 1166.5725 1194.9324 1227.6859 1240.0176 1284.3762 1302.7467 1338.7001 1394.1018 1424.8994 1440.0687 1460.8692 1485.1702 1558.9015 1595.1658 1632.7405 2199.5721 2970.3860 3052.6778 3125.5298 3134.1999 3147.4892 3163.8042 3212.8439 3586.3790
redmass: 4.9770 7.8267 4.2245 4.5232 3.7919 4.3249 3.5652 7.6074 2.9533 4.0343 1.3628 4.2891 3.5867 6.2659 3.2323 4.7562 1.3067 2.8740 1.6331 2.6952 1.5337 5.2089 3.3381 2.4332 1.4066 1.3064 4.2827 2.1955 1.6424 1.2736 1.0908 1.1575 2.5417 1.3659 1.5379 4.0704 1.5479 4.8711 2.4699 1.1437 4.2807 2.9946 6.4517 5.6268 7.2397 12.4519 1.0663 1.0920 1.0849 1.0892 1.0956 1.1003 1.0983 1.0807
irintensity: 7.3996 4.8802 8.4124 1.7978 0.6504 0.1902 1.0485 0.1510 8.0026 3.3439 59.4319 13.5153 0.0221 2.0436 25.5802 4.0742 44.3217 35.8075 56.6523 13.3113 4.2105 1.0016 4.1196 3.3485 6.9129 0.0374 2.8651 5.8178 3.5955 13.6738 1.6577 1.6591 5.8626 14.6911 4.1006 39.5887 4.0721 50.7126 14.1121 16.8805 21.9400 3.2421 11.3846 6.3751 2.7090 8.9814 16.1994 1.1324 0.2279 3.9512 33.5248 28.5315 3.6125 58.7029
temp: 298.150 k
press: 1.00000 atm
elementType: 7 7 6 6 6 6 6 6 6 6 6 6 1 1 1 1 1 1 1 1
symmnumber: 1
zpe: 403569.6 jmol-1
zpe.correction: 0.153712 hartree
zpe.thermalcorrener: 0.163362 hartree
zpe.thermalcorrenthalpy: 0.164306 hartree
zpe.thermalcorrgfe: 0.117601 hartree
zpe.sumelectzpe: -494.536712 hartree
zpe.sumelectthermal: -494.527062 hartree
zpe.sumelectthermalent: -494.526118 hartree
zpe.sumelectthermalfe: -494.572822 hartree
dipole: -0.6996 1.5553 1.6095
dipole: 2.3450
quadrupole: -76.5786 -61.9151 -74.0295
quadrupole: 10.1988 7.0565 -2.9645
quadrupole: -5.7375 8.9260 -3.1884 10.1988 7.0565 -2.9645
hfenergy: -494.6904235 hartree
pointgroup: C01 [X(C10H8N2)]
dipole: -0.2702267 -0.4397395 -0.7647119 debye
dipolederiv: -0.5719382 0.0831772 0.0671342 -0.2714093 -0.5588182 0.0239285 0.0865817 0.0127341 -0.2768587 -0.2797935 0.0001497 0.0025643 -0.1128999 -0.2430995 0.0002198 -0.0739965 0.0027525 -0.2146457 0.4067311 0.0578286 -0.0641353 0.4149908 -0.0475712 -0.0825869 -0.0042259 -0.0336613 0.0304121 0.1332199 -0.0163105 -0.0298801 -0.3583446 -0.1311591 0.0286738 -0.0597732 -0.018745 0.0298327 0.1263143 -0.0073231 -0.0060063 0.1008941 0.5752051 0.0120012 -0.1748825 0.0316976 -0.0194653 -0.2599984 -0.173504 -0.0442224 0.0121494 -0.0713684 0.0477714 -0.0358572 0.0469128 -0.2638866 0.0375104 -0.0608624 -0.0452503 -0.0438676 0.0595037 0.0392736 -0.0474614 0.0509684 -0.1762131 0.0960988 -0.0025473 -0.0447042 0.0644491 0.1180173 0.0373733 -0.0362613 0.0460302 -0.159638 0.2764222 0.0017603 -0.0532312 -0.0709186 0.1000176 -0.0790821 0.1037629 -0.0701966 0.1872721 -0.1094288 -0.0025126 -0.0196462 -0.0942121 0.0732226 0.0528746 -0.0276057 0.0389024 -0.1681121 -0.0214105 0.082174 -0.0197183 0.1725481 -0.0612489 -0.009234 -0.0047077 0.0042873 -0.1816008 -0.064332 0.0729245 0.0777143 0.2014995 0.0720472 0.0800652 0.0958568 0.0589629 -0.0010591 0.2205469 0.0121851 0.0275064 0.0093604 0.2002528 -0.0358915 0.0116489 -0.0518435 0.3145879 0.0655117 0.0457346 0.0296841 0.071176 -0.0187789 -0.0433473 0.0318108 -0.0367068 0.1870077 0.0770605 -0.0526387 0.0100457 -0.0074473 -0.0975768 -0.0379986 0.0161588 -0.0333558 0.1690632 0.0786028 -0.0071791 0.0134661 -0.0498844 -0.103219 -0.031752 0.00854 -0.0383722 0.1543986 -0.0777354 -0.0467414 0.0367966 -0.0989645 0.0786397 0.0445365 0.0799268 0.0134797 -0.0347828 0.0407015 0.0001505 -0.0256477 0.0431034 -0.0142538 -0.0052631 -0.0601745 0.0185018 0.11609 -0.0568621 0.0978626 0.0519791 0.1001297 0.0155494 -0.0396453 0.0543763 -0.0397386 0.1485514 -0.117221 -0.084328 0.0355509 -0.0823522 0.0546384 -0.0019171 0.0362829 -0.0026098 0.1590464 unknown
polarizability: 170.3103209|8.601721|114.5193704|-11.9891682|14.3920342|60.2280281 unknown
InChI: InChI=1S/C10H8N2/c11-6-5-9-7-8-3-1-2-4-10(8)12-9/h1-4,7,12H,5H2
charge 0 multiplicity 1
20 atoms
N  0.537805 0.89857 -0.213589
N  4.073396 1.526352 0.611406
C  -0.817311 0.604332 -0.012112
C  -0.975034 -0.816781 -0.192855
C  1.233824 -0.288969 -0.49519
C  0.336063 -1.355117 -0.495599
C  -1.900793 1.451657 0.307923
C  -2.267013 -1.389689 -0.050969
C  2.714874 -0.282551 -0.807332
C  -3.170772 0.854868 0.443629
C  -3.351831 -0.549432 0.265294
C  3.474042 0.706505 -0.014579
H  0.972054 1.811246 -0.080508
H  0.58616 -2.39726 -0.689244
H  -1.767779 2.530375 0.445978
H  -2.416989 -2.4667 -0.184578
H  2.895256 -0.062851 -1.880075
H  3.131832 -1.288108 -0.618416
H  -4.035449 1.481076 0.690186
H  -4.354734 -0.975924 0.378231
