program: Gaussian 09
title: 000169739
version: EM64L-G09RevD.01
frameworkgroup: C1[X(C14H18O3)]
method: RPBEPBE
basis: SDD
operation: Freq
keyword: #pfreq=noraman
keyword: PBEPBE/SDD
title: #p freq=noraman PBEPBE/SDD
converged: YES YES NO NO
title: Mulliken charges:
elementType: O O O C C C C C C C C C C C C C C H H H H H H H H H H H H H H H H H H
charge: -0.255717 -0.447067 -0.428179 -0.223300 -0.598744 0.349945 -0.046289 0.020326 0.192967 0.245151 -0.663305 0.362722 -0.349265 -0.612640 -0.847723 -0.851046 -0.339268 0.278392 0.241076 0.237898 0.250065 0.185655 0.217262 0.214967 0.252348 0.239069 0.232372 0.302023 0.239221 0.241996 0.230426 0.230178 0.194579 0.369363 0.334543
chargesum: 0.00000
title: Mulliken charges with hydrogens summed into heavy atoms:
elementType: O O O C C C C C C C C C C C C C C
charge: -0.255717 -0.077703 -0.093636 0.055092 -0.119771 0.349945 -0.046289 0.020326 0.192967 0.245151 -0.413241 0.362722 0.053653 -0.145326 -0.074260 -0.139403 0.085489
polarizability: 2.28871537e+02 7.44163159e+00 1.72137217e+02 -9.38879975e+00 3.46652487e+00 9.74422915e+01
1716.lowfreq: 0.0005 0.0006 0.0007 6.1457 9.3534 14.6426 35.5232 58.3098 63.0429
frequency: 35.5142 58.2748 63.0237 83.7818 130.7994 135.9883 146.6845 152.3262 167.1969 171.2471 200.5081 252.3857 264.6884 276.2988 303.1351 313.9455 328.0702 360.2600 370.4513 380.6724 407.3292 502.8069 514.4200 540.0813 558.6457 563.1611 594.8929 616.1918 655.9847 679.9717 717.6223 784.3236 794.5871 807.6593 863.6664 894.7378 922.7837 957.0098 964.6240 993.2631 1007.7817 1014.9236 1018.8310 1025.8770 1040.0083 1043.2405 1049.7985 1067.7045 1089.9247 1130.5902 1146.0082 1160.8496 1170.1754 1205.4134 1230.2860 1244.6675 1253.4858 1266.0695 1289.1750 1293.8439 1312.9617 1329.1229 1337.7233 1378.4139 1383.6498 1399.4469 1401.8010 1403.8187 1423.8656 1426.8936 1453.7455 1469.0030 1472.2213 1477.0680 1480.4868 1482.5375 1492.9913 1500.1340 1582.1225 1584.4677 1612.6616 2932.2679 2962.8313 2975.5228 2977.6841 2978.9004 2993.2801 2998.8012 3047.2262 3051.8631 3052.7698 3057.6095 3062.4329 3087.3138 3089.5939 3114.0351 3125.9110 3409.1591 3560.2245
redmass: 5.9644 6.0795 4.0387 4.1710 1.8594 1.3473 2.3798 1.3120 2.3118 2.7944 2.4538 3.9342 3.6303 3.0099 2.7799 1.6398 3.3718 3.3406 2.4360 4.5873 4.5305 4.8500 4.2632 3.2393 2.9195 3.6278 1.7218 1.9224 4.5926 5.1614 3.9321 3.1742 2.5525 1.4467 1.5220 1.9410 1.9379 3.3033 2.4411 5.3034 1.5356 3.7515 1.9845 2.5933 1.7044 1.7352 2.4974 1.7946 2.4281 2.2271 1.5519 1.2351 1.2115 1.4786 2.7633 1.3358 1.4857 1.4118 1.1979 1.9618 4.6361 1.2865 1.3150 1.2243 3.3923 1.2766 1.2763 1.2661 2.3930 2.8107 1.1191 1.1473 1.2132 1.0941 1.2258 1.1037 1.0584 1.1001 8.7920 6.9016 7.5096 1.0693 1.0694 1.0386 1.0416 1.0649 1.0817 1.0634 1.0967 1.0960 1.0939 1.0947 1.0939 1.0980 1.0978 1.0981 1.0919 1.0659 1.0663
irintensity: 0.3768 2.0142 0.4745 0.8433 2.3916 6.2710 3.4479 2.7169 2.6831 1.0500 2.0444 1.0225 27.0224 8.0294 20.6915 103.4233 9.7098 1.9267 23.1741 2.7962 1.9753 12.9767 10.7244 2.7790 5.7698 6.4967 66.7910 123.8581 6.3522 0.8538 4.8015 3.0240 1.9519 5.7496 6.9499 40.7512 38.2244 69.2667 56.9578 71.4091 11.1225 82.7786 3.3181 9.8187 1.0188 5.7381 6.3267 19.3348 17.1384 4.5488 30.8578 13.4549 18.0914 21.2778 41.7702 11.7274 0.9716 21.2656 1.0127 30.1549 45.9349 45.2462 8.8062 31.1919 25.9981 34.2806 29.0276 127.9157 5.2494 18.4310 29.9707 13.5495 17.4865 2.4786 28.7047 11.2873 20.3622 8.0747 149.6670 155.2909 40.1470 64.0001 50.4484 24.5668 26.2850 16.9233 12.0646 38.5018 13.3106 12.1473 23.6400 42.5544 8.2313 31.8472 14.5226 0.8326 16.8017 76.8883 10.0587
temp: 298.150 k
press: 1.00000 atm
elementType: 8 8 8 6 6 6 6 6 6 6 6 6 6 6 6 6 6 1 1 1 1 1 1 1 1 1 1 1 1 1 1 1 1 1 1
symmnumber: 1
zpe: 760587.1 jmol-1
zpe.correction: 0.289692 hartree
zpe.thermalcorrener: 0.306918 hartree
zpe.thermalcorrenthalpy: 0.307862 hartree
zpe.thermalcorrgfe: 0.244916 hartree
zpe.sumelectzpe: -768.683073 hartree
zpe.sumelectthermal: -768.665847 hartree
zpe.sumelectthermalent: -768.664903 hartree
zpe.sumelectthermalfe: -768.727849 hartree
dipole: 4.3225 5.4320 -0.8382
dipole: 6.9924
quadrupole: -120.2305 -101.8406 -101.6394
quadrupole: -1.1287 -5.6144 2.3804
quadrupole: -12.3270 6.0629 6.2641 -1.1287 -5.6144 2.3804
hfenergy: -768.9727655 hartree
pointgroup: C01 [X(C14H18O3)]
dipole: -1.6918523 2.1476379 0.3055206 debye
polarizability: 228.8231559|-7.7760441|172.1193205|-9.2134911|-4.2285818|97.5085692 unknown
InChI: InChI=1S/C14H18O3/c1-8-5-10-6-11(7-16)14(17)13(10)9(2)12(8)3-4-15/h5,11,15-16H,3-4,6-7H2,1-2H3
charge 0 multiplicity 1
35 atoms
O  2.311069 -1.971769 0.082098
O  4.995167 -1.053735 -0.01191
O  -5.14601 -1.504115 -0.507728
C  2.992735 0.333265 -0.521038
C  2.234401 1.67677 -0.354093
C  0.784167 1.273583 -0.123386
C  0.644144 -0.132356 0.040192
C  1.980119 -0.757124 -0.109069
C  -0.621772 -0.733801 0.302661
C  -1.762742 0.119867 0.377997
C  -0.343154 2.103946 -0.037019
C  -1.620262 1.538322 0.210206
C  4.31076 0.19984 0.286003
C  -3.143278 -0.483375 0.604607
C  -0.740735 -2.235369 0.501287
C  -2.820777 2.464767 0.31478
C  -3.856487 -0.836848 -0.728382
H  3.248916 0.157749 -1.585516
H  2.348762 2.337877 -1.231443
H  2.620015 2.238878 0.52055
H  -0.246946 3.189417 -0.156142
H  4.089399 0.293995 1.373435
H  5.012914 1.003288 0.003195
H  -3.785157 0.216909 1.17326
H  -3.077683 -1.408971 1.202061
H  -1.027055 -2.471167 1.545032
H  -1.518532 -2.675063 -0.148867
H  0.217584 -2.73544 0.299198
H  -3.248633 2.458549 1.335889
H  -2.537776 3.504263 0.079808
H  -3.632424 2.173247 -0.37691
H  -3.264279 -1.568854 -1.301146
H  -3.978681 0.071362 -1.356263
H  4.317192 -1.782763 0.07962
H  -5.753163 -0.888041 -0.024965
