program: Gaussian 09
title: 000169713
version: EM64L-G09RevD.01
frameworkgroup: C1[X(C19H23N3O)]
method: RPBEPBE
basis: SDD
operation: Freq
keyword: #p
keyword: freq=noraman
keyword: PBEPBE/SDD
title: #p freq=noraman PBEPBE/SDD
converged: YES YES NO NO
title: Mulliken charges:
elementType: O N N N C C C C C C C C C C C C C C C C C C C H H H H H H H H H H H H H H H H H H H H H H H
charge: -0.271211 -0.255298 -0.407353 -0.136696 -0.292686 0.324235 -0.593374 -0.236512 -0.511436 0.367932 0.254874 -0.173027 -0.382831 0.236869 0.206785 -0.437107 -0.435259 -0.367617 -0.204134 -0.347770 -0.386316 -0.663633 -0.649688 0.251848 0.243313 0.206657 0.217091 0.223167 0.244137 0.243269 0.237995 0.264802 0.237523 0.301650 0.226652 0.215668 0.200135 0.259850 0.222981 0.229584 0.253761 0.202328 0.215320 0.225266 0.220953 0.217304
chargesum: 0.00000
title: Mulliken charges with hydrogens summed into heavy atoms:
elementType: O N N N C C C C C C C C C C C C C C C C C C C
charge: -0.271211 -0.012028 -0.105702 -0.136696 -0.040838 0.324235 -0.143405 -0.019421 -0.044132 0.367932 0.254874 -0.173027 -0.144836 0.236869 0.206785 -0.172305 -0.197736 -0.140965 0.011534 0.112215 0.066248 0.007776 0.013834
polarizability: 3.40483695e+02 2.10334297e-01 2.30736392e+02 -8.38863774e+00 2.35667277e+00 1.43025824e+02
1716.lowfreq: -12.5907 -1.7316 0.0003 0.0007 0.0009 4.5882 27.0744 30.5846 42.4154
frequency: 26.9160 30.5415 42.3944 56.4025 78.8943 84.2565 103.5648 119.2879 156.1566 182.7497 191.1232 213.7102 214.9451 231.8350 238.3423 265.5961 298.9981 318.8702 320.2756 336.2933 359.7831 374.5561 397.4885 420.7855 460.5316 493.1345 494.6670 505.4370 518.4678 547.4579 568.5260 593.7832 597.2628 613.0880 618.1791 650.7165 670.2235 685.8392 733.2437 736.2287 751.5530 769.3209 776.4728 778.9933 794.0227 806.2642 812.2373 847.5228 851.5199 885.4838 902.8468 921.1717 943.3790 956.5215 965.3588 980.8487 1020.6219 1038.2230 1049.2884 1065.8311 1069.4709 1079.8891 1082.5880 1093.3577 1097.5247 1102.1553 1109.9909 1132.5868 1140.1281 1172.8490 1184.9322 1199.0797 1211.5799 1232.3964 1236.5409 1256.4971 1269.5929 1283.1954 1292.4592 1297.6503 1301.7744 1310.0189 1319.4283 1332.8604 1340.3616 1345.3885 1350.2028 1358.3763 1383.0905 1387.7579 1401.3983 1406.8183 1420.5151 1448.4189 1451.9094 1453.3628 1456.1107 1462.3870 1465.6432 1467.9481 1478.4890 1483.4503 1494.4055 1495.6958 1570.1698 1570.5810 1609.5425 1622.5566 1655.7971 2935.3452 2948.7480 2954.4984 2982.6212 2983.3569 2991.7237 2998.2784 3004.1257 3042.3809 3055.6698 3061.0013 3065.9474 3082.2982 3082.8519 3091.4696 3101.6926 3120.2472 3124.8108 3141.2256 3157.3829 3219.7210 3404.6204 3615.1796
redmass: 4.3637 4.1074 4.1807 2.9102 3.3744 4.1446 3.9434 3.5193 4.1541 2.3979 2.8100 2.5357 1.3372 1.3628 3.2359 2.9116 2.7225 3.0283 3.4474 2.8409 3.5218 4.7350 4.7261 2.6102 4.5604 3.6688 1.4231 3.5924 2.6944 4.3531 4.4240 3.5808 3.4398 3.2415 3.5186 2.7591 1.8334 7.2523 3.2562 3.8419 1.7360 1.4681 1.2712 1.5615 1.8543 3.5827 2.3596 2.6068 2.2696 1.4536 3.2165 2.2729 2.3717 1.3359 2.5326 2.1773 2.8702 2.4998 2.8919 2.0531 2.0673 2.1139 2.4148 1.9193 2.2258 2.4785 2.1843 2.8633 1.9375 1.3537 1.2978 1.4039 2.8820 1.5431 1.8385 1.6673 1.3608 1.4955 1.8173 1.2764 1.3703 1.4530 1.2552 2.3008 1.2993 1.4432 1.7204 1.2935 1.2184 1.2122 3.1641 2.3698 3.0310 3.0608 1.1844 1.1237 1.1051 1.2892 1.0443 1.0438 1.0607 1.0567 1.1310 3.1037 6.9390 6.1772 8.4279 7.0026 8.5864 1.0710 1.0812 1.0793 1.0360 1.0355 1.0599 1.0643 1.0645 1.0923 1.1052 1.0971 1.0991 1.0992 1.0985 1.1014 1.1017 1.0903 1.0857 1.0918 1.0983 1.0982 1.0739 1.0808
irintensity: 0.9154 1.8896 1.4441 1.1387 0.1634 2.3539 0.4952 0.0429 0.4684 2.9449 5.6707 4.9475 0.2343 0.3474 5.5869 2.8111 0.8906 3.3607 0.6925 8.8606 15.3100 1.4369 7.5459 8.0803 1.7367 0.4623 90.2575 14.2893 11.1385 4.3120 0.8124 3.0105 2.2182 18.8451 6.3551 23.4056 78.9555 4.6067 25.5382 2.0890 52.8826 19.7064 29.9816 40.7229 2.4765 7.0635 16.1003 5.1540 6.6177 0.9114 19.1471 13.6131 16.1456 1.1173 9.3545 4.5890 0.7412 12.9421 3.8278 44.4782 8.0082 17.5793 6.7183 39.1714 5.2750 9.5340 3.2225 78.0469 61.2055 14.6820 1.5634 4.5771 36.4145 38.2900 31.8824 11.1249 30.8492 6.0589 8.2468 11.1415 50.9007 4.0265 1.6378 7.4764 7.6256 6.4418 18.2690 12.2906 17.2784 26.6983 8.4614 147.3218 8.5879 16.1952 22.3814 17.4257 9.7479 12.9235 3.0242 13.2124 8.0513 10.3963 14.6268 0.7934 18.0485 212.4898 10.6791 5.3073 1.5485 21.7817 27.5816 53.9639 28.7852 22.5650 58.8048 37.6914 47.1411 25.4670 34.4671 3.2240 11.6859 37.8295 49.8791 52.7538 33.7477 12.0733 1.4591 15.6719 31.5100 1.6594 2.0435 66.4961
temp: 298.150 k
press: 1.00000 atm
elementType: 8 7 7 7 6 6 6 6 6 6 6 6 6 6 6 6 6 6 6 6 6 6 6 1 1 1 1 1 1 1 1 1 1 1 1 1 1 1 1 1 1 1 1 1 1 1
symmnumber: 1
zpe: 1010977.0 jmol-1
zpe.correction: 0.385061 hartree
zpe.thermalcorrener: 0.405989 hartree
zpe.thermalcorrenthalpy: 0.406933 hartree
zpe.thermalcorrgfe: 0.334814 hartree
zpe.sumelectzpe: -975.618879 hartree
zpe.sumelectthermal: -975.597950 hartree
zpe.sumelectthermalent: -975.597006 hartree
zpe.sumelectthermalfe: -975.669126 hartree
dipole: -0.3476 -2.9318 2.6263
dipole: 3.9514
quadrupole: -89.5247 -135.7518 -141.7020
quadrupole: 3.1280 -7.1742 -0.1180
quadrupole: 32.8015 -13.4256 -19.3758 3.1280 -7.1742 -0.1180
hfenergy: -976.0039395 hartree
pointgroup: C01 [X(C19H23N3O1)]
dipole: -0.1257027 1.072834 -1.1180526 debye
polarizability: 340.1634552|1.1345475|230.6116123|11.4890141|-4.0869355|143.4708439 unknown
InChI: InChI=1S/C19H23N3O/c1-3-22(4-2)19(23)13-8-15-14-6-5-7-16-18(14)12(10-20-16)9-17(15)21-11-13/h5-8,10,13,17,20-21H,3-4,9,11H2,1-2H3
charge 0 multiplicity 1
46 atoms
O  -2.76642 -1.536978 0.971138
N  -0.426125 2.306045 0.357393
N  5.318439 0.431924 0.054045
N  -4.312612 -0.261185 -0.202102
C  0.795139 1.483439 0.531779
C  0.651042 0.04432 -0.030328
C  2.016119 2.273632 -0.038155
C  -1.867767 0.33989 -0.322251
C  -1.670637 1.567485 0.638895
C  3.254993 1.415717 0.0202
C  1.899757 -0.758019 -0.05667
C  3.104987 -0.014338 -0.005618
C  -0.56741 -0.445089 -0.402192
C  4.394818 -0.622807 0.008411
C  -3.007766 -0.562995 0.184382
C  4.624525 1.665757 0.063213
C  2.030012 -2.166761 -0.091239
C  4.52209 -2.03015 -0.035161
C  3.31931 -2.776946 -0.086178
C  -5.406163 -1.11884 0.321509
C  -4.700761 0.834906 -1.118095
C  -5.973603 -0.598344 1.658983
C  -4.792503 0.390829 -2.595972
H  0.970224 1.371262 1.623693
H  2.115246 3.217331 0.528153
H  1.792955 2.549768 -1.092535
H  -2.116846 0.728892 -1.332426
H  -2.527123 2.264624 0.5766
H  -1.623096 1.188886 1.67705
H  -0.444824 2.73131 -0.582187
H  -0.64824 -1.476475 -0.767266
H  5.170254 2.607119 0.09776
H  1.139841 -2.805209 -0.091692
H  6.330306 0.333658 0.085196
H  5.49394 -2.535459 -0.02508
H  3.382092 -3.871123 -0.109053
H  -6.200687 -1.16946 -0.447015
H  -4.99528 -2.132203 0.465805
H  -5.684002 1.217805 -0.783529
H  -3.994716 1.676195 -1.017397
H  -5.184841 -0.60689 2.429998
H  -6.361242 0.432905 1.562267
H  -6.802228 -1.244417 2.003414
H  -3.81022 0.048185 -2.967372
H  -5.508256 -0.442248 -2.714752
H  -5.132221 1.228451 -3.23302
