program: Gaussian 09
title: 000169665
version: EM64L-G09RevD.01
frameworkgroup: C1[X(C9H18O)]
method: RPBEPBE
basis: SDD
operation: Freq
keyword: #pfreq=noraman
keyword: PBEPBE/SDD
title: #p freq=noraman PBEPBE/SDD
converged: YES YES NO NO
title: Mulliken charges:
elementType: O C C C C C C C C C H H H H H H H H H H H H H H H H H H
charge: -0.194821 -0.373112 -0.391988 -0.022532 -0.367052 -0.371150 -0.715839 -0.714822 -0.449934 -0.068173 0.187310 0.187791 0.206324 0.190849 0.192895 0.186559 0.189082 0.215135 0.215491 0.223202 0.202794 0.210918 0.211906 0.212429 0.205445 0.231184 0.231592 0.168517
chargesum: 0.00000
title: Mulliken charges with hydrogens summed into heavy atoms:
elementType: O C C C C C C C C C
charge: -0.194821 0.001989 0.005185 0.170363 0.008589 0.059477 -0.078925 -0.085042 0.012842 0.100344
polarizability: 1.22932838e+02 9.37462735e-01 9.52834256e+01 2.22111707e-01 -3.00703328e+00 8.07674971e+01
1716.lowfreq: -5.5303 -0.0008 -0.0005 -0.0004 14.4100 28.1306 36.8710 54.0789 65.0740
frequency: 33.4464 54.0643 65.0130 85.5843 120.2905 139.8886 152.3501 172.1531 208.4633 218.3658 241.2185 295.3988 352.8941 395.4776 438.0698 472.9649 659.2151 680.6728 725.5109 763.8204 814.6108 856.0761 890.2283 914.6422 930.0337 947.3116 958.4818 1021.6033 1025.1482 1046.7744 1079.4837 1084.1590 1125.2618 1139.0703 1178.0945 1184.3883 1225.0677 1228.2942 1268.1081 1271.3087 1286.4390 1294.8070 1307.0296 1331.1432 1336.1895 1357.3539 1360.6509 1375.8402 1379.4795 1392.1542 1425.1591 1455.7098 1463.1343 1469.1846 1470.6427 1473.3769 1481.0749 1484.4773 1490.0666 1645.5035 2847.3904 2944.3916 2945.3487 2950.5233 2953.7295 2964.0786 2965.4630 2969.6833 2982.2131 2989.8851 2992.5615 2998.9368 3032.3868 3054.8166 3057.1624 3063.8327 3068.3152 3073.8043
redmass: 3.7758 2.7895 4.1730 1.9370 2.2267 1.8306 4.2323 1.7275 1.5087 1.9095 1.1340 2.8818 2.7343 2.2053 2.2891 2.9014 1.1535 4.9765 1.0884 1.2270 2.5002 1.2814 3.1200 1.1751 1.4862 1.4436 1.5829 1.3379 3.4229 2.8002 2.1818 2.5721 1.5890 2.4726 1.7498 1.8324 1.3347 1.3796 1.2714 1.2303 1.0905 1.1124 1.3961 1.4328 1.5464 1.5579 1.6338 1.2209 1.2387 1.2143 1.1050 1.0728 1.0705 1.0602 1.0716 1.0624 1.0606 1.0928 1.0504 7.5068 1.0837 1.0617 1.0618 1.0601 1.0788 1.0597 1.0375 1.0364 1.0955 1.0948 1.0614 1.1019 1.1037 1.1033 1.0992 1.0990 1.0993 1.0985
irintensity: 3.9105 2.1842 2.0268 0.5140 1.1813 0.2173 5.2556 0.8384 0.1533 0.0051 0.1977 5.3700 0.0442 1.3509 1.2758 0.1698 11.0629 6.5367 6.3992 0.9848 1.1014 1.1373 12.6063 4.4803 5.4967 0.7803 0.6287 1.5815 0.0359 0.3207 0.0846 2.0260 0.4054 2.8318 12.4520 3.6828 20.5821 4.6083 3.8900 2.8592 0.2209 0.3407 2.0808 2.8710 15.3503 1.5513 2.6028 18.0911 7.5424 15.2052 31.9936 0.4459 0.4428 1.8819 2.9078 3.2980 8.8443 10.7126 29.4611 121.5861 167.5319 10.8823 24.1920 28.5951 16.0988 48.5068 65.8624 27.4733 11.5547 7.6135 33.8414 3.6067 44.2068 78.9990 12.1509 99.7490 60.4621 55.7953
temp: 298.150 k
press: 1.00000 atm
elementType: 8 6 6 6 6 6 6 6 6 6 1 1 1 1 1 1 1 1 1 1 1 1 1 1 1 1 1 1
symmnumber: 1
zpe: 655535.3 jmol-1
zpe.correction: 0.249680 hartree
zpe.thermalcorrener: 0.262834 hartree
zpe.thermalcorrenthalpy: 0.263779 hartree
zpe.thermalcorrgfe: 0.209010 hartree
zpe.sumelectzpe: -428.131496 hartree
zpe.sumelectthermal: -428.118342 hartree
zpe.sumelectthermalent: -428.117398 hartree
zpe.sumelectthermalfe: -428.172166 hartree
dipole: -1.1751 -2.6363 0.8739
dipole: 3.0157
quadrupole: -73.0416 -66.7202 -63.1848
quadrupole: -12.8220 4.8272 1.0272
quadrupole: -5.3928 0.9287 4.4641 -12.8220 4.8272 1.0272
hfenergy: -428.3811762 hartree
pointgroup: C01 [X(C9H18O1)]
dipole: -0.477394 1.0371959 -0.3225917 debye
polarizability: 122.956916|-0.4589743|95.393145|0.0812654|-2.6702013|80.6337 unknown
InChI: InChI=1S/C9H18O/c1-9(2)7-5-3-4-6-8-10/h8-9H,3-7H2,1-2H3
charge 0 multiplicity 1
28 atoms
O  4.589841 -1.011871 0.360837
C  -2.051668 0.565715 -0.098496
C  -0.716578 -0.177611 0.134084
C  -3.321739 -0.227717 0.311267
C  0.520136 0.695728 -0.176779
C  1.85547 -0.046009 0.050741
C  -3.508362 -1.510466 -0.535761
C  -4.576783 0.671712 0.209807
C  3.080258 0.833339 -0.258358
C  4.425674 0.165074 -0.041051
H  -2.031298 1.518067 0.472443
H  -2.135995 0.84732 -1.170154
H  -0.677434 -1.091595 -0.49164
H  -0.666743 -0.519015 1.189454
H  -3.200983 -0.531772 1.373646
H  0.490124 1.608573 0.455314
H  0.463826 1.045577 -1.229372
H  1.89338 -0.956796 -0.577683
H  1.917184 -0.400691 1.097685
H  -2.665821 -2.21477 -0.414305
H  -3.587278 -1.256488 -1.611132
H  -4.43354 -2.043541 -0.247163
H  -4.47408 1.577982 0.835945
H  -5.484869 0.131981 0.537212
H  -4.73842 0.999559 -0.835617
H  3.072098 1.761386 0.355897
H  3.058934 1.195464 -1.310332
H  5.312266 0.814765 -0.270488
