program: Gaussian 09
title: 000169738
version: EM64L-G09RevD.01
frameworkgroup: C1[X(C21H30O8)]
method: RPBEPBE
basis: SDD
operation: Freq
keyword: #pfreq=noraman
keyword: PBEPBE/SDD
title: #p freq=noraman PBEPBE/SDD
converged: YES YES NO NO
title: Mulliken charges:
elementType: O O O O O O O O C C C C C C C C C C C C C C C C C C C C C H H H H H H H H H H H H H H H H H H H H H H H H H H H H H H
charge: -0.286508 -0.236966 -0.425915 -0.456397 -0.431943 -0.447515 -0.205278 -0.432280 0.164781 -0.255851 0.241403 -0.040497 -0.002403 -0.148753 -0.201181 -0.094022 0.171336 -0.069834 0.038276 -0.746511 -0.761121 0.236201 -0.645544 0.349906 -0.598121 -0.280975 -0.350716 -0.852629 -0.850335 0.253309 0.201934 0.271036 0.243878 0.211805 0.180841 0.240331 0.225125 0.213153 0.213396 0.245085 0.248594 0.272876 0.248179 0.242551 0.204302 0.219877 0.204487 0.229170 0.341394 0.238148 0.303499 0.228041 0.241366 0.242507 0.236661 0.364515 0.334994 0.366194 0.352148
chargesum: 0.00000
title: Mulliken charges with hydrogens summed into heavy atoms:
elementType: O O O O O O O O C C C C C C C C C C C C C C C C C C C C C
charge: -0.286508 -0.236966 -0.084521 -0.091882 -0.096950 -0.081321 -0.205278 -0.080132 0.164781 -0.002542 0.241403 -0.040497 -0.002403 0.053180 0.069855 0.149856 0.171336 0.141971 0.219117 -0.067902 -0.054046 0.236201 -0.372669 0.349906 -0.107391 0.143203 0.082941 -0.082940 -0.129802
polarizability: 3.36029161e+02 2.17407897e+01 2.57792627e+02 -1.37045168e+01 1.49520079e+01 1.90545453e+02
1716.lowfreq: -7.3007 -5.1313 0.0002 0.0005 0.0012 4.2621 5.2987 14.4154 20.1386
frequency: 0.5335 13.4605 19.9732 39.8891 44.2495 52.4598 66.6493 80.8579 93.2727 98.6802 108.6396 124.9764 130.0130 140.2945 149.2005 159.1969 175.3439 188.6290 198.3056 210.4355 214.5093 230.7516 245.0069 248.7816 262.7091 269.2554 277.6161 284.7405 290.0604 304.5880 311.1497 331.8539 336.5050 342.7009 354.0776 361.7913 372.9446 379.8680 396.0518 403.1352 407.6676 435.8158 438.9009 458.0812 467.0441 474.5958 496.0042 526.1362 537.9801 549.3851 553.5976 582.6625 587.6392 604.1976 607.9941 640.9541 681.3213 689.0787 731.3508 773.6600 799.6886 806.4531 837.4537 843.0477 887.9818 903.3205 912.0634 929.6926 931.6555 935.6574 950.3930 965.2961 984.3606 988.9340 997.6959 1003.2410 1005.9965 1012.1324 1023.1486 1027.8848 1038.6221 1040.4172 1052.7171 1055.0670 1069.0776 1078.3884 1084.1933 1088.1463 1104.4885 1115.7033 1122.6885 1126.9255 1170.7808 1179.7295 1181.5928 1182.7866 1197.9322 1203.4031 1216.3942 1220.4894 1221.3962 1231.9342 1246.5539 1260.3623 1274.2506 1279.0716 1289.7550 1292.0857 1303.1039 1308.0858 1326.1028 1328.2889 1338.0706 1347.6120 1363.8860 1364.8923 1370.1979 1374.8801 1379.0383 1380.8897 1381.2309 1393.1291 1400.1503 1402.2742 1417.1215 1422.1675 1423.0480 1460.1158 1463.7652 1466.8400 1470.6618 1470.7737 1478.5121 1480.4922 1483.1851 1489.8980 1494.8545 1498.5753 1584.6610 1598.2180 1623.2984 2903.5355 2907.2408 2917.0074 2956.4749 2973.0452 2974.0917 2974.9702 2978.5466 2982.5196 3004.2027 3024.0227 3025.1462 3027.7454 3048.9097 3054.6687 3067.9060 3068.0054 3078.2891 3082.8255 3089.4771 3089.8754 3094.1791 3097.3813 3110.1031 3139.1411 3525.7146 3541.6496 3547.0182 3549.8158 3553.3825
redmass: 5.4118 5.5585 5.1881 4.3678 5.7318 5.2321 4.5678 4.4790 5.3383 6.9392 5.3738 1.1318 2.2387 3.1289 3.1991 1.1772 3.0353 3.1845 2.3818 1.7936 2.2307 4.8034 3.9625 2.4579 1.6118 4.1846 2.2727 3.3739 3.6132 3.6749 3.4134 2.2624 1.6679 3.0047 2.4302 1.5882 3.0544 2.8062 2.5679 1.6780 3.3431 1.5428 3.7495 1.2981 2.9852 2.5176 4.1658 4.8396 3.2171 3.9004 3.7638 4.2569 4.3209 3.6782 4.1073 3.9792 3.8073 4.1067 5.3343 3.7494 1.3528 4.1524 2.7472 2.8094 2.6882 1.4684 6.7154 5.0648 4.2159 4.1489 1.4673 5.7971 3.4284 1.9013 2.2713 1.3459 3.9373 1.4681 2.6808 2.5930 1.9529 1.5968 3.8127 2.5670 3.3579 3.9890 2.1786 2.6356 2.5171 3.1225 2.5677 2.5460 1.2362 1.3404 1.3528 1.8961 1.3100 1.7107 2.2752 1.7274 1.1795 2.2131 1.2162 1.1622 1.2121 2.1060 1.2199 1.4089 1.3043 6.4702 1.2900 1.2933 1.2999 1.3672 1.2203 1.1922 1.4622 1.2177 1.5036 1.6181 2.3089 1.2357 1.2381 1.3118 1.6403 3.4594 2.5070 1.0844 1.0510 1.3083 1.0488 1.0924 1.1896 1.0581 1.0885 1.0601 1.0523 1.0974 7.9744 7.1218 9.8878 1.0826 1.0821 1.0818 1.0596 1.0683 1.0363 1.0403 1.0388 1.0355 1.0846 1.0844 1.0772 1.0835 1.0949 1.0953 1.0979 1.0857 1.0994 1.1031 1.1005 1.0989 1.0998 1.0955 1.0982 1.0918 1.0658 1.0655 1.0654 1.0656 1.0657
irintensity: 0.0645 0.0627 0.2210 0.2971 1.2246 3.0189 1.5449 8.3634 0.2851 2.9697 1.5143 0.5588 0.7277 0.0913 2.5222 0.5271 2.5589 0.5401 0.6186 3.8736 1.5349 17.8946 1.8543 0.3917 5.8949 0.9560 1.5651 4.6438 5.4436 3.8550 3.9334 34.7999 19.0350 32.6640 7.2709 93.5096 21.5982 58.2137 32.4642 72.6249 3.9213 115.8069 21.5435 124.3229 89.8168 57.2520 10.3983 3.3078 3.0005 28.4717 2.3831 2.1334 5.9263 25.1224 8.6575 0.1774 8.8296 2.5612 4.1063 8.5489 5.8641 9.9067 30.3586 7.7194 27.3427 5.6462 216.9625 198.2860 137.9302 0.9746 1.9893 118.5744 41.6991 91.1899 42.5921 10.4070 42.3697 1.4060 18.1750 15.0007 45.8630 6.5085 33.6916 50.9202 134.5368 2.3239 8.9561 41.4617 10.3278 55.8926 104.0101 11.1767 1.9163 20.9418 11.0652 5.5003 43.2252 20.0785 7.5774 3.9057 30.1214 24.0355 16.5430 16.4134 1.1607 5.6764 40.4536 2.4483 14.0849 44.7093 37.0409 9.2725 14.5475 21.7840 19.6075 31.1342 9.4216 27.7790 7.6303 7.5315 20.3917 31.6535 31.6849 20.9111 21.5159 26.2434 1.8158 5.1426 5.2363 32.4349 8.7952 9.0506 25.5289 12.4115 6.9146 17.3837 20.2967 8.0311 8.0504 191.9339 76.9866 8.3096 5.1576 101.2600 37.9027 52.9716 25.0211 27.4860 23.8703 27.1018 30.5440 11.5488 15.1410 27.5942 17.8929 15.6538 29.6651 15.4576 39.1613 23.3081 2.5806 14.4055 21.1270 19.2162 1.0892 6.9170 11.8225 19.7023 9.8968 19.6076 6.8134
temp: 298.150 k
press: 1.00000 atm
elementType: 8 8 8 8 8 8 8 8 6 6 6 6 6 6 6 6 6 6 6 6 6 6 6 6 6 6 6 6 6 1 1 1 1 1 1 1 1 1 1 1 1 1 1 1 1 1 1 1 1 1 1 1 1 1 1 1 1 1 1
symmnumber: 1
zpe: 1264471.8 jmol-1
zpe.correction: 0.481612 hartree
zpe.thermalcorrener: 0.512910 hartree
zpe.thermalcorrenthalpy: 0.513854 hartree
zpe.thermalcorrgfe: 0.414703 hartree
zpe.sumelectzpe: -1417.747720 hartree
zpe.sumelectthermal: -1417.716422 hartree
zpe.sumelectthermalent: -1417.715478 hartree
zpe.sumelectthermalfe: -1417.814628 hartree
dipole: -2.4897 -3.3611 -1.4302
dipole: 4.4206
quadrupole: -164.8194 -190.6878 -171.5772
quadrupole: -5.0186 15.3325 -0.3355
quadrupole: 10.8754 -14.9930 4.1176 -5.0186 15.3325 -0.3355
hfenergy: -1418.2293317 hartree
pointgroup: C01 [X(C21H30O8)]
dipole: -0.9718672 -1.2844258 -0.6561127 debye
polarizability: 335.5341642|23.4657443|255.5536908|-12.8354641|19.6177978|193.2793863 unknown
InChI: InChI=1S/C21H30O8/c1-9-7-12-14(19(27)21(3,4)18(12)26)10(2)11(9)5-6-28-20-17(25)16(24)15(23)13(8-22)29-20/h7,13,15-18,20,22-26H,5-6,8H2,1-4H3
charge 0 multiplicity 1
59 atoms
O  -3.670903 0.947173 0.138845
O  -2.326717 -0.911402 0.633883
O  6.335525 -1.233431 -1.433969
O  -7.069885 -1.491497 0.283294
O  -7.352175 1.253558 -0.715995
O  -4.490361 -2.693244 -0.087009
O  4.390113 2.492242 1.123277
O  -3.634443 3.64651 -0.767795
C  5.842359 1.003963 -0.242366
C  5.390868 -0.125642 -1.238968
C  4.024813 -0.561217 -0.723978
C  3.497764 0.363996 0.213789
C  4.515458 1.427731 0.454316
C  -5.956351 -0.736226 -0.296451
C  -6.112871 0.774699 -0.065143
C  -4.677399 -1.307653 0.33923
C  2.20311 0.186976 0.780361
C  -4.850238 1.5106 -0.559906
C  -3.450855 -0.507999 -0.127442
C  6.524014 2.197531 -0.940489
C  6.771078 0.427095 0.863992
C  1.457426 -0.966867 0.390595
C  3.293341 -1.698395 -1.095663
C  2.006407 -1.913819 -0.538688
C  0.054732 -1.187335 0.945301
C  -1.018926 -0.543111 0.049355
C  -4.833658 3.006521 -0.229412
C  1.654937 1.183577 1.788615
C  1.239684 -3.165669 -0.931897
H  5.305239 0.296215 -2.257095
H  -5.908345 -0.920354 -1.39729
H  -6.280632 0.980604 1.006334
H  -4.75519 -1.227509 1.443008
H  -4.730037 1.371726 -1.661303
H  -3.287366 -0.642669 -1.224118
H  6.710831 3.008623 -0.215113
H  7.486653 1.884381 -1.383692
H  5.889022 2.607217 -1.747482
H  6.306842 -0.42295 1.400831
H  7.723235 0.08905 0.417982
H  6.989649 1.211674 1.608788
H  3.711941 -2.412568 -1.812927
H  -0.045998 -0.762156 1.958304
H  -0.180007 -2.262497 1.027004
H  -0.960609 -0.931625 -0.989399
H  -0.91587 0.558674 0.022591
H  -4.901333 3.131237 0.871891
H  -5.689702 3.513353 -0.701999
H  6.414564 -1.737518 -0.584134
H  1.547681 0.717819 2.787733
H  2.327169 2.048879 1.884623
H  0.652287 1.547946 1.499051
H  1.776549 -3.724399 -1.716291
H  1.107186 -3.845483 -0.068253
H  0.227295 -2.938498 -1.312759
H  -7.913182 -1.034376 0.028166
H  -7.234627 1.215261 -1.701704
H  -5.321576 -3.18322 0.144906
H  -2.853413 3.157001 -0.400434
