program: Gaussian 09
title: 000169660
version: EM64L-G09RevD.01
frameworkgroup: C1[X(C2HCl4NO)]
method: RPBEPBE
basis: SDD
operation: Freq
keyword: #p
keyword: freq=noraman
keyword: PBEPBE/SDD
title: #p freq=noraman PBEPBE/SDD
converged: YES YES NO NO
title: Mulliken charges:
elementType: Cl Cl Cl Cl O N C C H
charge: 0.062258 0.153642 0.149981 0.196452 -0.170322 -0.625895 -0.648395 0.513976 0.368303
chargesum: 0.00000
title: Mulliken charges with hydrogens summed into heavy atoms:
elementType: Cl Cl Cl Cl O N C C
charge: 0.062258 0.153642 0.149981 0.196452 -0.170322 -0.257591 -0.648395 0.513976
polarizability: 9.25579335e+01 -3.27808409e+00 7.19301677e+01 -2.38757532e-01 3.68797667e-02 5.62433810e+01
1716.lowfreq: -15.1172 -12.1225 -7.0222 -0.0042 -0.0019 -0.0013 8.2016 116.6939 142.3900
frequency: 3.7940 116.6855 142.3898 200.4353 204.8417 231.3022 263.2651 270.1893 338.1497 368.2845 501.1906 627.7648 646.3198 687.9303 754.4371 805.1359 934.3763 1148.5727 1372.2248 1657.2039 3526.1283
redmass: 17.1931 10.2691 22.5240 19.6405 18.6817 23.8932 22.7678 24.3052 17.6663 28.7441 1.1508 9.6740 14.2430 11.1819 10.4750 8.3971 11.8606 2.4748 1.6465 12.3634 1.0805
irintensity: 2.5123 1.6485 1.4434 0.9765 0.0280 3.9645 2.0174 2.7009 7.3676 6.5978 167.8397 78.7535 118.6836 114.9821 103.7243 26.2613 3.9510 3.2336 66.3786 183.9496 96.1562
temp: 298.150 k
press: 1.00000 atm
elementType: 17 17 17 17 8 7 6 6 1
symmnumber: 1
zpe: 88527.4 jmol-1
zpe.correction: 0.033718 hartree
zpe.thermalcorrener: 0.042987 hartree
zpe.thermalcorrenthalpy: 0.043931 hartree
zpe.thermalcorrgfe: -0.004783 hartree
zpe.sumelectzpe: -2046.354122 hartree
zpe.sumelectthermal: -2046.344854 hartree
zpe.sumelectthermalent: -2046.343910 hartree
zpe.sumelectthermalfe: -2046.392623 hartree
dipole: -0.9255 3.1281 -0.0020
dipole: 3.2621
quadrupole: -70.2784 -75.9320 -72.3466
quadrupole: -4.7205 -0.0237 -0.0184
quadrupole: 2.5739 -3.0797 0.5057 -4.7205 -0.0237 -0.0184
hfenergy: -2046.3878403 hartree
pointgroup: C01 [X(C2H1Cl4N1O1)]
dipole: -0.3253697 0.9890222 0.7504245 debye
dipolederiv: -0.2965626 -0.0542751 -0.0239734 -0.0727775 -0.6673524 -0.3348464 -0.0339127 -0.3378017 -0.3849165 -0.2559102 -0.060225 0.23275 -0.0344407 -0.1262541 0.1203219 0.2396508 0.128056 -0.6370171 -0.319464 0.2262739 -0.1547468 0.2447174 -0.458819 0.2402564 -0.1393536 0.2384875 -0.2611214 -0.42896 0.0339151 0.0783007 -0.0611163 0.0844682 -0.0303696 0.0074513 -0.0386117 0.1048156 -0.4575376 -0.1958653 -0.128319 0.1322523 -0.6623493 -0.2987826 0.1099036 -0.2633864 -0.486837 0.1339375 0.2596226 0.1324139 0.3046184 -0.5572871 -0.0863698 0.1687569 -0.088705 -0.5630679 0.6281157 -0.2043106 -0.0899065 -0.1378111 1.3358092 -0.0556604 -0.0401886 -0.0494171 1.3839846 0.7869219 0.031851 -0.0365929 -0.4692138 0.7395943 0.5115206 -0.3926506 0.462746 0.4983518 0.2094593 -0.0369865 -0.0099259 0.0937712 0.3121902 -0.0660701 0.080343 -0.0513675 0.3458079 unknown
polarizability: 92.0877409|-1.3733957|66.3958407|-4.7180642|7.5562187|62.2479007 unknown
InChI: InChI=1S/C2HCl4NO/c3-2(4,5)1(8)7-6/h7H
charge 0 multiplicity 1
9 atoms
Cl 1.185316 1.748009 0.938404
Cl 1.739579 0.498764 -1.767281
Cl 1.90778 -1.192451 0.743276
Cl -3.146674 0.120458 0.244869
O  -0.750559 -1.281503 -1.022323
N  -1.40146 0.49928 0.356763
C  0.993863 0.171783 -0.109366
C  -0.493807 -0.284585 -0.312264
H  -1.162937 1.316746 0.925822
