program: Gaussian 09
title: 000169653
version: EM64L-G09RevD.01
frameworkgroup: C1[X(C24H24)]
method: RPBEPBE
basis: SDD
operation: Freq
keyword: #p
keyword: freq=noraman
keyword: PBEPBE/SDD
title: #p freq=noraman PBEPBE/SDD
converged: YES YES NO NO
title: Mulliken charges:
elementType: C C C C C C C C C C C C C C C C C C C C C C C C H H H H H H H H H H H H H H H H H H H H H H H H
charge: -0.796871 -0.700802 -0.700797 -0.796873 -0.796869 -0.700801 -0.700803 -0.796875 0.492633 0.493209 0.493219 0.492625 0.492635 0.493213 0.493220 0.492642 -0.461977 -0.462958 -0.462964 -0.461969 -0.461975 -0.462964 -0.462964 -0.461979 0.225583 0.225670 0.238345 0.253995 0.238345 0.253997 0.225580 0.225672 0.225674 0.225579 0.253993 0.238347 0.253994 0.238346 0.225671 0.225581 0.246603 0.246566 0.246566 0.246604 0.246603 0.246565 0.246566 0.246604
chargesum: 0.00000
title: Mulliken charges with hydrogens summed into heavy atoms:
elementType: C C C C C C C C C C C C C C C C C C C C C C C C
charge: -0.345619 -0.208462 -0.208455 -0.345621 -0.345617 -0.208462 -0.208464 -0.345623 0.492633 0.493209 0.493219 0.492625 0.492635 0.493213 0.493220 0.492642 -0.215373 -0.216392 -0.216398 -0.215366 -0.215372 -0.216398 -0.216398 -0.215375
polarizability: 2.50228475e+02 7.90843594e-04 2.50225676e+02 -4.00132322e-04 8.29685338e-04 2.32936700e+02
1716.lowfreq: -0.0007 -0.0004 0.0008 6.2472 6.2530 11.1697 38.8158 50.2135 52.9386
frequency: 38.8005 50.2135 52.9369 64.5238 64.5253 72.1112 106.5875 155.2639 193.1577 193.1639 211.4488 211.4504 248.5275 280.5621 300.7441 312.6189 331.7598 331.7642 360.5244 360.5269 373.2435 380.3657 402.3737 404.2913 404.2986 411.0407 522.0848 522.0861 524.0946 536.3076 597.0097 604.1706 621.1361 621.1388 709.1252 709.1264 712.3793 729.3570 803.4547 825.2566 825.2610 857.6276 862.8926 865.0301 865.0309 865.7504 879.8935 880.8942 881.2498 881.2512 890.5920 900.7092 900.7111 902.5684 903.0443 904.7429 904.7479 907.1139 931.8703 940.0778 940.0796 943.0502 1012.8596 1016.5417 1016.5421 1026.5853 1071.4775 1078.5907 1078.5928 1080.6075 1126.5664 1130.0543 1130.0563 1138.8417 1144.5934 1159.8518 1159.8531 1163.9951 1211.3242 1211.3250 1212.2678 1217.3588 1220.7854 1231.8595 1231.8609 1241.4829 1273.8871 1285.9084 1285.9101 1294.0589 1309.2227 1315.1415 1315.1440 1320.7502 1340.6023 1347.6913 1347.6923 1353.5202 1394.2940 1396.3954 1396.3985 1405.8327 1450.6595 1450.9093 1450.9099 1451.2126 1558.9826 1565.9481 1565.9515 1575.1184 1612.0209 1617.9730 1617.9755 1621.9640 2952.4983 2952.4988 2952.5989 2952.7580 2972.3427 2972.9785 2972.9819 2973.2378 3003.1054 3003.1962 3003.1972 3003.3357 3019.9571 3022.0619 3022.0703 3023.0446 3149.3283 3149.5155 3149.5704 3149.5745 3170.2892 3170.2933 3170.2985 3170.4836
redmass: 3.6518 3.8328 4.0396 3.3310 3.3310 5.9969 3.9501 4.0638 2.9962 2.9963 4.5401 4.5400 3.8315 1.9097 4.5328 3.8912 3.0002 3.0002 2.1082 2.1081 1.5436 1.8364 1.9724 2.0220 2.0220 4.2477 2.6149 2.6150 2.4349 2.5923 3.8898 3.2731 3.4740 3.4739 3.7544 3.7544 3.8370 3.8388 1.7051 1.7707 1.7707 1.6374 3.8734 3.6643 3.6643 2.7222 1.6310 1.7641 1.6964 1.6964 3.8642 1.7021 1.7021 1.5202 2.0991 2.2217 2.2217 2.1030 1.5985 2.2846 2.2845 2.8631 1.5208 1.4386 1.4386 1.4499 1.1134 1.1544 1.1544 1.1454 1.5064 1.5483 1.5483 1.5963 1.5107 1.2906 1.2906 1.1845 2.8562 2.8560 2.7073 1.2752 3.3701 1.3586 1.3586 1.4381 1.8952 2.2700 2.2701 2.1480 2.3219 2.3024 2.3022 3.0591 2.0616 2.2971 2.2971 2.2949 1.1044 1.1022 1.1022 1.1029 1.0841 1.0845 1.0845 1.0848 8.7573 7.9773 7.9773 7.1343 6.4659 6.2407 6.2407 6.1492 1.0588 1.0588 1.0588 1.0589 1.0641 1.0644 1.0644 1.0642 1.1006 1.1002 1.1002 1.0997 1.0938 1.0931 1.0931 1.0927 1.0924 1.0923 1.0923 1.0923 1.1011 1.1011 1.1010 1.1011
irintensity: 0.0000 0.0060 0.0000 0.1429 0.1429 0.0000 0.0147 0.0000 1.2771 1.2771 0.0080 0.0080 0.0000 2.6260 0.0000 0.0076 7.8297 7.8299 1.2575 1.2570 6.7335 0.0000 0.0002 50.6419 50.6438 0.0055 1.3620 1.3620 0.0000 0.0015 0.0119 0.0000 3.3031 3.3015 1.1534 1.1534 0.0008 0.0000 3.2987 33.8738 33.8762 0.0000 0.0001 2.0703 2.0693 0.0000 0.0000 3.5656 49.5446 49.5435 0.0000 0.3918 0.3905 0.3546 6.1651 17.4516 17.4532 0.0000 0.0000 0.2948 0.2948 0.0543 0.0000 7.9318 7.9317 42.1607 0.0011 0.1533 0.1535 0.0000 0.0003 22.2526 22.2526 0.0000 0.0000 20.8943 20.8949 0.0001 0.6790 0.6789 0.0000 0.0000 4.1032 5.5706 5.5690 0.0022 2.0708 3.8535 3.8542 0.0000 0.0000 11.9585 11.9606 0.0030 12.4846 3.5552 3.5551 0.0000 48.7587 6.3343 6.3290 0.0000 0.0002 17.6007 17.6011 0.0003 27.2275 9.6974 9.6971 0.0000 0.0000 14.0219 14.0222 0.0003 104.8007 104.8098 0.0735 0.0099 18.8188 0.1120 0.1108 0.0001 0.0006 0.2340 0.2247 71.2399 0.3167 32.0729 32.0745 0.0001 0.0013 0.0278 47.7826 47.7814 9.0716 9.9777 47.6412 0.0065
temp: 298.150 k
press: 1.00000 atm
elementType: 6 6 6 6 6 6 6 6 6 6 6 6 6 6 6 6 6 6 6 6 6 6 6 6 1 1 1 1 1 1 1 1 1 1 1 1 1 1 1 1 1 1 1 1 1 1 1 1
symmnumber: 1
zpe: 1048556.2 jmol-1
zpe.correction: 0.399374 hartree
zpe.thermalcorrener: 0.419804 hartree
zpe.thermalcorrenthalpy: 0.420748 hartree
zpe.thermalcorrgfe: 0.350803 hartree
zpe.sumelectzpe: -927.153930 hartree
zpe.sumelectthermal: -927.133501 hartree
zpe.sumelectthermalent: -927.132556 hartree
zpe.sumelectthermalfe: -927.202501 hartree
dipole: 0.0000 -0.0001 -0.0001
dipole: 0.0001
quadrupole: -142.5291 -142.5287 -132.7989
quadrupole: -0.0001 -0.0007 0.0007
quadrupole: -3.2435 -3.2432 6.4866 -0.0001 -0.0007 0.0007
hfenergy: -927.5533042 hartree
pointgroup: C01 [X(C24H24)]
dipole: 0.0000199 -0.0000147 0.0000201 debye
polarizability: 250.2263675|0.0014428|250.2277834|0.0006743|-0.0006275|232.9366997 unknown
InChI: InChI=1S/C24H24/c1-2-18-9-17(1)13-19-3-4-21(10-19)15-23-7-8-24(12-23)16-22-6-5-20(11-22)14-18/h1-8H,9-16H2
charge 0 multiplicity 1
48 atoms
C  3.728846 0.173115 -0.020607
C  1.729947 1.904224 -0.454368
C  1.904294 -1.73008 0.454261
C  -0.173123 3.728866 0.020661
C  0.173128 -3.728875 0.020278
C  -1.904221 1.729981 0.454522
C  -1.729961 -1.904176 -0.45447
C  -3.728849 -0.17312 -0.02043
C  2.832293 1.316385 0.417309
C  2.937343 -1.053084 -0.437033
C  1.053118 2.937357 0.436956
C  1.316394 -2.832282 -0.417559
C  -1.316427 2.832326 -0.417188
C  -1.053099 -2.937412 0.436708
C  -2.937383 1.053136 -0.436757
C  -2.832273 -1.316435 0.417319
C  2.804166 1.961075 1.63296
C  2.955926 -1.711967 -1.645238
C  1.712179 2.9560 1.645062
C  1.961012 -2.803966 -1.633242
C  -1.961192 2.804209 -1.632798
C  -1.712113 -2.956193 1.644839
C  -2.956113 1.712218 -1.644851
C  -2.804099 -1.961265 1.632893
H  4.368446 0.482141 -0.872983
H  4.416445 -0.071653 0.815185
H  2.148297 2.374295 -1.369817
H  1.021835 1.133356 -0.817904
H  2.374466 -2.148597 1.369584
H  1.133451 -1.02205 0.818005
H  -0.482077 4.368434 0.873088
H  0.07157 4.416501 -0.815124
H  -0.071606 -4.416445 -0.815548
H  0.482136 -4.368505 0.872638
H  -1.133331 1.021878 0.818027
H  -2.374261 2.148331 1.369987
H  -1.021854 -1.13327 -0.817937
H  -2.148344 -2.374134 -1.369962
H  -4.416415 0.071549 0.815418
H  -4.368486 -0.482057 -0.872812
H  3.472764 1.761001 2.475625
H  3.593657 -1.460499 -2.498032
H  1.460845 3.593783 2.497856
H  1.760894 -3.472438 -2.475998
H  -1.76117 3.472814 -2.475471
H  -1.460744 -3.594072 2.497551
H  -3.593946 1.460889 -2.497609
H  -3.472665 -1.761288 2.475607
