program: Gaussian 09
title: 000169595
version: EM64L-G09RevD.01
frameworkgroup: C1[X(C10H12O2)]
method: RPBEPBE
basis: SDD
operation: Freq
keyword: #pfreq=noraman
keyword: PBEPBE/SDD
title: #p freq=noraman PBEPBE/SDD
converged: NO YES NO NO
title: Mulliken charges:
elementType: O O C C C C C C C C C C H H H H H H H H H H H H
charge: -0.194564 -0.243725 -0.171251 -0.084391 -0.681734 -0.681670 -0.320126 0.080811 0.252527 -0.358009 -0.252142 -0.182935 0.210073 0.271812 0.214227 0.217396 0.228482 0.228514 0.217388 0.214252 0.220513 0.253900 0.294595 0.266058
chargesum: 0.00000
title: Mulliken charges with hydrogens summed into heavy atoms:
elementType: O O C C C C C C C C C C
charge: -0.194564 -0.243725 0.038822 0.187421 -0.021629 -0.021517 -0.099613 0.080811 0.252527 -0.104109 0.042453 0.083123
polarizability: 1.81843695e+02 -3.61245654e+00 1.07321334e+02 6.08873680e-02 -2.49448211e-02 6.75787838e+01
1716.lowfreq: -14.8890 -6.7168 -3.7517 -0.0004 -0.0003 0.0006 31.2413 41.7780 78.1468
frequency: 31.2145 41.7178 78.1417 95.4810 125.9781 187.0155 193.1015 222.2307 233.0884 256.0167 341.8443 384.8139 392.5469 449.7520 520.2980 588.3810 598.6573 721.8548 727.1409 753.0232 822.0780 846.0229 859.8506 860.4760 884.9669 920.9145 923.1533 948.3634 956.7425 973.9445 997.1277 1041.8624 1091.3038 1096.5841 1135.0334 1143.2056 1181.2421 1207.0392 1236.0146 1283.0640 1295.7083 1300.8321 1349.2341 1365.0467 1375.6205 1393.4958 1463.3087 1467.4879 1476.3923 1479.1481 1486.6103 1536.2529 1558.9027 1650.0887 2976.1622 2977.9605 2986.9960 3070.8332 3074.9048 3081.2147 3082.4723 3086.5965 3124.0616 3226.8465 3268.5467 3276.1350
redmass: 3.2398 3.8179 4.2680 3.3845 3.4446 2.6615 1.0560 4.3280 1.3028 3.6484 4.1102 2.6952 2.4895 4.2105 3.6525 3.8116 3.4948 2.6884 1.2745 5.6015 1.5803 5.6786 2.5554 1.4285 2.0900 1.1968 2.5156 2.6388 1.4225 2.6539 1.1644 3.1528 2.0734 2.5594 1.9027 1.8355 1.7750 1.3205 1.5010 1.9779 1.4277 1.3195 1.7143 4.0045 1.1883 1.2086 1.0452 1.0493 1.0491 4.8515 1.0630 9.1344 6.6248 6.2519 1.0348 1.0351 1.0848 1.1002 1.0962 1.0933 1.1007 1.0995 1.0903 1.0929 1.1012 1.1063
irintensity: 0.5644 0.0481 0.4033 0.2279 0.8938 1.8099 0.0527 0.1510 0.8941 0.1394 5.5473 2.1347 0.0698 0.0189 6.6879 13.8354 0.3965 28.6681 45.4248 45.6366 44.6392 25.6104 10.3854 4.5875 5.3731 3.8358 85.5263 6.2998 0.5713 18.4285 42.0212 47.3950 3.4427 3.2631 82.7485 3.4763 7.8886 8.6101 3.0122 74.2116 6.1956 0.1416 69.5200 10.4845 13.8471 5.0739 5.7438 2.1670 12.7375 77.0360 8.8996 103.8154 159.9735 195.1709 29.4471 39.6551 15.5435 0.6716 39.1666 39.4073 25.7942 43.0567 15.9157 0.9720 0.9685 3.9761
temp: 298.150 k
press: 1.00000 atm
elementType: 8 8 6 6 6 6 6 6 6 6 6 6 1 1 1 1 1 1 1 1 1 1 1 1
symmnumber: 1
zpe: 507109.8 jmol-1
zpe.correction: 0.193148 hartree
zpe.thermalcorrener: 0.205561 hartree
zpe.thermalcorrenthalpy: 0.206506 hartree
zpe.thermalcorrgfe: 0.153059 hartree
zpe.sumelectzpe: -537.771712 hartree
zpe.sumelectthermal: -537.759298 hartree
zpe.sumelectthermalent: -537.758354 hartree
zpe.sumelectthermalfe: -537.811801 hartree
dipole: -1.4932 -3.5233 0.0113
dipole: 3.8267
quadrupole: -63.5199 -70.9267 -74.1809
quadrupole: -2.7030 0.0012 0.0297
quadrupole: 6.0226 -1.3842 -4.6384 -2.7030 0.0012 0.0297
hfenergy: -537.9648598 hartree
pointgroup: C01 [X(C10H12O2)]
dipole: -0.5837281 1.3877776 -0.0023888 debye
dipolederiv: -0.9277772 0.0018042 0.0028574 -0.2692526 -0.3563281 0.0002316 0.0025798 -0.000641 -0.1299403 -0.7873918 -0.0467697 0.0009833 0.0560074 -0.8972205 0.0019437 -0.0001449 0.0018805 -0.3370293 -0.1501515 0.0608546 0.0000511 -0.1167205 0.1575985 -0.0000714 -0.0004097 -0.0002538 0.0692244 0.7919586 -0.1029547 -0.0014994 0.0449273 0.1019113 -0.0014222 -0.0012915 -0.0011553 -0.1714656 -0.0253932 -0.0010257 0.0438021 0.1563867 0.0683004 -0.007859 -0.0877243 0.0347227 -0.006293 -0.0256347 -0.0014304 -0.0436581 0.1576025 0.068031 0.00666 0.0871265 -0.0354121 -0.0062685 -1.2603332 0.2450751 0.0011832 0.1249432 0.0121004 -0.0016289 0.0022336 -0.0017423 -0.1998655 2.1634687 0.0739905 -0.0042047 -0.2502741 0.8822783 -0.0021006 -0.0025559 -0.002378 0.2261745 -0.9948437 -0.1589314 0.0030296 0.045341 -0.0546642 0.0003421 0.0029646 0.0006741 -0.0453442 -0.0323191 0.0273858 -0.000623 0.1169142 0.0339307 0.0002049 -0.0017455 0.0001736 -0.1835848 0.8559485 0.0737586 -0.0032385 -0.0486894 0.0040278 0.0004212 -0.0028668 0.0003173 -0.0776723 0.050476 -0.1654813 -0.0012583 0.0099757 0.2142914 0.0008496 -0.0003854 0.0015375 -0.1471184 -0.0007654 -0.0965147 0.0004617 -0.0289882 -0.1565072 0.000772 0.0003024 0.0008846 0.0257411 0.0798738 -0.0161277 0.0001781 -0.013735 -0.0406052 0.0009455 0.0000632 0.0008945 0.1378823 0.0899043 -0.0380156 0.0239822 -0.0904867 -0.1400412 0.0309998 -0.0067412 -0.0305879 0.073527 -0.1695011 0.1139639 0.0403221 0.1227486 0.0171864 0.0042103 0.0530139 0.0162889 0.0725778 0.0523046 -0.04061 -0.1184266 -0.037001 0.081435 -0.0431308 -0.0758996 -0.0334507 -0.1131014 0.0529225 -0.0395482 0.1181877 -0.0362354 0.0820284 0.0416453 0.0757094 0.0319904 -0.1142527 -0.1698711 0.1135924 -0.0403978 0.1222947 0.0170159 -0.0041674 -0.0534778 -0.0161805 0.0730911 0.0898573 -0.0381246 -0.0237485 -0.0905781 -0.1399689 -0.0289467 0.0074357 0.0324195 0.073552 0.0759667 -0.0155223 0.0002789 -0.0054448 -0.1144139 0.0013086 0.0002765 0.0012731 0.1540436 0.0959603 0.0948177 0.0006029 0.0798422 0.0318101 -0.0006864 0.0006601 -0.0006152 0.1885387 0.102295 0.0123109 0.000503 -0.0157047 0.0748494 -0.0002634 0.0001818 -0.0004423 0.2107553 0.0430457 -0.0564975 0.0006318 -0.033873 0.0529543 -0.0002578 0.0006953 -0.0001977 0.2268282 unknown
polarizability: 181.8619349|3.4109521|107.3023613|-0.298287|-0.0082707|67.5795165 unknown
InChI: InChI=1S/C10H12O2/c1-8(2)3-4-10(11)9-5-6-12-7-9/h3-8H,1-2H3
charge 0 multiplicity 1
24 atoms
O  4.003753 0.011865 -0.011416
O  0.226232 -1.977757 0.006769
C  -3.345309 0.577729 0.005561
C  -2.089286 -0.261336 0.006817
C  -4.179704 0.292234 1.285387
C  -4.183659 0.281911 -1.269326
C  -0.81002 0.21141 0.001354
C  0.361649 -0.708776 0.002207
C  1.718243 -0.101508 -0.002353
C  2.118085 1.302005 -0.001085
C  2.898558 -0.839642 -0.008148
C  3.496386 1.331594 -0.006799
H  -3.063895 1.649974 0.000774
H  -2.220386 -1.356139 0.012295
H  -4.473726 -0.773274 1.331166
H  -5.102894 0.90068 1.285659
H  -3.606676 0.528082 2.199536
H  -3.613447 0.51031 -2.187114
H  -5.106768 0.890471 -1.271604
H  -4.47789 -0.783903 -1.30561
H  -0.622522 1.292403 -0.004308
H  1.466881 2.173372 0.003825
H  3.100536 -1.906049 -0.011017
H  4.242762 2.120145 -0.008168
