program: Gaussian 09
title: 000169649
version: EM64L-G09RevD.01
frameworkgroup: C1[X(C17H30N2O3Si)]
method: RPBEPBE
basis: SDD
operation: Freq
keyword: #p
keyword: freq=noraman
keyword: PBEPBE/SDD
title: #p freq=noraman PBEPBE/SDD
converged: YES YES NO NO
title: Mulliken charges:
elementType: Si O O O N N C C C C C C C C C C C C C C C C C H H H H H H H H H H H H H H H H H H H H H H H H H H H H H H
charge: 1.545837 -0.575579 -0.578296 -0.592309 -0.284173 -0.304268 -0.338864 -0.922804 -0.348896 -0.372545 -0.365601 -0.530570 0.334890 0.256757 -0.491910 -0.491927 -0.477997 -0.440250 -0.379088 -0.239831 -0.246264 -0.200522 -0.591135 0.204593 0.226457 0.249732 0.254620 0.173072 0.206124 0.226916 0.167668 0.240393 0.167731 0.230873 0.254595 0.202295 0.231247 0.237139 0.205804 0.215608 0.238582 0.214762 0.208462 0.227505 0.220882 0.215871 0.232517 0.231393 0.227314 0.226137 0.274270 0.211721 0.211064
chargesum: 0.00000
title: Mulliken charges with hydrogens summed into heavy atoms:
elementType: Si O O O N N C C C C C C C C C C C C C C C C C
charge: 1.545837 -0.575579 -0.578296 -0.592309 -0.043781 -0.049673 0.092186 -0.418452 0.030300 0.022039 0.033002 -0.097028 0.334890 0.256757 0.166641 0.169879 0.186261 -0.207732 -0.147695 -0.012517 -0.020127 0.073748 -0.168350
polarizability: 2.92982528e+02 -1.22778286e+01 2.45709247e+02 -1.32937703e+01 -1.47054229e+01 1.69025390e+02
1716.lowfreq: -23.3366 -13.7594 -0.8813 0.0007 0.0014 0.0016 3.7079 5.4773 13.8728
frequency: -20.1897 -11.2339 13.3041 17.2153 24.9654 41.4807 48.7031 51.9720 58.6545 61.7597 68.6648 75.0914 82.2605 88.1217 100.8684 105.7896 116.6502 118.2202 127.2388 140.8604 150.8812 156.5715 157.4292 183.9011 198.8123 225.5360 242.1394 264.2941 282.5166 295.7453 316.1462 341.2821 368.9843 398.1615 429.2140 448.9994 471.7864 479.6007 527.0902 557.3769 571.3954 613.3184 655.5436 674.2673 683.6415 683.9322 713.7990 737.9649 754.8919 761.8304 786.6222 788.2587 817.4081 834.5563 838.9301 883.2036 934.2800 951.6410 964.4665 987.5211 988.8262 1006.6582 1015.6679 1021.8051 1030.9543 1035.0338 1043.0650 1046.4490 1060.3232 1064.3383 1068.1467 1091.7488 1099.2339 1106.6372 1118.9729 1120.9816 1122.4335 1131.0406 1143.5698 1145.1372 1149.4249 1151.5669 1153.6363 1174.2336 1194.8721 1196.9676 1217.9195 1230.9410 1239.7313 1257.0070 1270.9312 1281.1376 1287.5575 1295.0829 1312.4079 1322.2363 1347.9404 1374.1731 1378.6166 1402.8630 1427.4567 1432.1829 1441.6847 1441.9190 1444.9778 1445.6399 1448.4817 1453.8058 1468.3010 1468.8832 1471.3743 1472.1144 1474.5660 1476.6652 1477.1219 1477.7728 1481.8764 1490.2393 1495.3004 1497.9234 1577.3341 1609.9272 1641.1645 2827.5963 2835.0487 2844.6131 2871.3839 2941.7338 2943.4865 2957.9508 2972.7029 2985.9009 2986.6611 2995.5040 3021.2939 3023.4801 3024.3901 3031.3378 3037.6964 3044.2705 3055.0376 3089.0206 3089.6526 3092.0969 3092.8511 3110.1139 3114.9511 3126.8364 3142.5404 3160.7524 3196.4365 3424.7648 3434.0480
redmass: 2.8325 4.5048 3.1022 4.6846 3.9959 3.4601 3.1091 1.1128 3.4423 1.4335 1.8836 2.6122 3.3132 2.3991 1.2784 2.1351 3.1907 2.3110 3.1678 3.1800 2.4706 2.8522 3.3706 2.7899 4.1221 4.1747 2.7928 3.7682 4.2966 4.6747 3.1044 5.8998 4.0266 5.8170 2.5064 4.4028 3.3700 3.6957 3.2424 3.9131 5.4081 4.3953 1.9549 1.3389 1.7156 1.8785 8.4816 2.8182 1.3893 1.6039 4.8062 2.2717 1.1817 1.4963 3.1132 1.5064 1.3526 1.4194 1.8295 1.6894 1.9647 1.3553 3.5174 1.7356 1.2663 3.1303 5.7561 5.5014 1.6947 5.0347 2.6245 2.0762 2.4876 1.6991 1.2553 1.2547 1.2549 3.7964 1.3883 1.4236 1.4629 1.3973 2.9278 1.0875 1.5808 1.5548 1.3881 1.8302 1.5687 1.2596 1.1628 1.4433 1.0931 1.2064 1.2695 1.3028 1.3855 1.5332 4.2062 1.5008 1.0835 1.3106 2.2816 1.1228 1.1222 1.2264 1.1155 1.2249 1.0518 1.0524 1.0516 1.0606 1.0530 1.0958 1.0538 2.0452 1.1065 1.1187 1.0948 1.0851 6.0510 6.2432 4.3305 1.0722 1.0715 1.0713 1.0711 1.0331 1.0333 1.0313 1.0659 1.0872 1.0626 1.0795 1.0834 1.1027 1.1028 1.0980 1.0906 1.1036 1.1008 1.0993 1.0992 1.0598 1.1016 1.0940 1.0870 1.0874 1.0935 1.1006 1.1134 1.0738 1.0746
irintensity: 0.0750 0.1631 0.6021 0.0848 0.0144 0.8169 3.9956 0.0087 3.7899 1.6268 1.2403 4.3566 1.9538 0.4577 1.1161 1.0128 3.1231 9.8512 1.7711 9.1756 3.6511 2.3630 15.5861 3.0349 11.4397 4.4741 3.6330 3.2433 7.4311 6.0883 1.0469 14.6802 4.6895 46.8366 3.7864 14.6312 2.5516 0.8199 7.3451 5.0949 28.8286 5.7698 1.1527 127.6947 70.7416 8.7076 120.0037 3.4971 46.5001 45.6979 74.0380 43.5345 7.6620 19.0295 1.6987 0.5189 71.4319 6.0431 8.3973 10.2707 12.2105 8.2766 10.9802 10.9771 16.4195 31.5596 242.9497 440.7351 7.3899 20.6540 7.6546 18.7293 6.4612 22.7906 0.9446 1.1207 0.5958 31.5774 30.4823 66.1201 2.0961 24.0487 71.1207 0.6190 2.7361 10.2188 25.3824 23.8796 1.9453 4.4196 0.2728 8.6562 0.8305 17.9673 5.9315 0.6840 0.5268 5.0779 3.9660 0.7153 14.5210 14.8110 6.1804 1.0695 0.2492 56.6813 3.6484 39.9679 12.3057 13.4981 1.1681 4.5627 2.3047 5.6667 2.9781 22.4836 1.2849 8.8864 0.5752 7.9162 2.6345 0.1223 5.9972 151.0904 71.8826 147.4185 106.1643 139.7963 15.6646 81.3682 5.8670 20.8658 10.9402 44.7863 18.2455 17.2772 116.6903 1.9319 40.2896 51.0553 51.9151 30.1230 42.1640 7.1692 32.7059 13.3771 9.6870 4.5180 28.3845 32.5667 22.1764 1.3453 0.2111
temp: 298.150 k
press: 1.00000 atm
elementType: 14 8 8 8 7 7 6 6 6 6 6 6 6 6 6 6 6 6 6 6 6 6 6 1 1 1 1 1 1 1 1 1 1 1 1 1 1 1 1 1 1 1 1 1 1 1 1 1 1 1 1 1 1
symmnumber: 1
zpe: 1170946.1 jmol-1
zpe.correction: 0.445990 hartree
zpe.thermalcorrener: 0.474019 hartree
zpe.thermalcorrenthalpy: 0.474963 hartree
zpe.thermalcorrgfe: 0.382009 hartree
zpe.sumelectzpe: -1288.562301 hartree
zpe.sumelectthermal: -1288.534272 hartree
zpe.sumelectthermalent: -1288.533328 hartree
zpe.sumelectthermalfe: -1288.626282 hartree
dipole: -0.3438 -1.0942 -1.7114
dipole: 2.0602
quadrupole: -142.1434 -133.2409 -155.0012
quadrupole: -8.8265 8.4481 3.9007
quadrupole: 1.3185 10.2209 -11.5394 -8.8265 8.4481 3.9007
hfenergy: -1289.008291 hartree
pointgroup: C01 [X(C17H30N2O3Si1)]
dipole: -0.1304709 -0.5607658 -0.5705261 debye
polarizability: 293.1494745|-14.5255613|236.4441894|-9.490393|-29.1225533|178.1235011 unknown
InChI: InChI=1S/C17H30N2O3Si/c1-5-16-9-6-7-10-17(16)15-19-13-12-18-11-8-14-23(20-2,21-3)22-4/h5-7,9-10,18-19H,1,8,11-15H2,2-4H3
charge 0 multiplicity 1
53 atoms
Si -6.245935 -0.009873 -0.065614
O  -6.603303 -1.498797 0.722407
O  -6.369141 1.102859 1.239826
O  -7.394156 0.326241 -1.309391
N  -0.902034 -0.308898 0.33591
N  2.877087 -0.32666 0.295464
C  -3.371633 -0.171956 0.078933
C  -4.552281 0.005224 -0.9097
C  -2.007632 -0.206746 -0.639129
C  0.454662 -0.310387 -0.245576
C  1.517134 -0.251813 0.867048
C  3.970084 -0.197112 1.292533
C  5.343394 -0.392933 0.6604
C  5.89062 0.554982 -0.265248
C  -6.794818 -2.772643 0.039149
C  -6.0109 2.514839 1.174617
C  -8.837793 0.45737 -1.113847
C  6.105315 -1.530758 1.020325
C  7.186009 0.309883 -0.801812
C  7.392906 -1.756406 0.484653
C  7.933766 -0.826494 -0.433134
C  5.111474 1.757302 -0.64979
C  5.621851 2.9074 -1.171514
H  -3.507403 -1.107548 0.66074
H  -3.354929 0.650581 0.818917
H  -4.538032 -0.79643 -1.674991
H  -4.448924 0.959158 -1.463465
H  -2.00965 -1.03982 -1.389758
H  -1.870496 0.73228 -1.212545
H  0.563868 0.58212 -0.889452
H  0.65324 -1.201013 -0.899321
H  -1.039916 -1.101768 0.979267
H  1.316262 -1.065075 1.613931
H  1.41061 0.705838 1.409841
H  3.005901 -1.162533 -0.292065
H  3.858868 -0.921897 2.136243
H  3.892964 0.815242 1.738479
H  -7.066328 -3.509218 0.812784
H  -5.867431 -3.111716 -0.467117
H  -7.608068 -2.719838 -0.712348
H  -6.152009 2.924069 2.188084
H  -6.659589 3.069182 0.4672
H  -4.951932 2.660143 0.876321
H  -9.279383 0.644017 -2.106383
H  -9.075729 1.303563 -0.440698
H  -9.273923 -0.466416 -0.685609
H  5.681998 -2.24667 1.736006
H  7.599387 1.011375 -1.535033
H  7.963675 -2.645192 0.775499
H  8.926872 -0.993225 -0.865562
H  4.027412 1.671807 -0.497715
H  4.966264 3.742956 -1.439847
H  6.696343 3.061102 -1.330712
