program: Gaussian 09
title: 000169550
version: EM64L-G09RevD.01
frameworkgroup: C1[X(C13H17Cl2NO2)]
method: RPBEPBE
basis: SDD
operation: Freq
keyword: #p
keyword: freq=noraman
keyword: PBEPBE/SDD
title: #p freq=noraman PBEPBE/SDD
converged: YES YES NO NO
title: Mulliken charges:
elementType: Cl Cl O O N C C C C C C C C C C C C C H H H H H H H H H H H H H H H H H
charge: -0.071988 -0.073888 -0.288464 -0.224144 -0.116816 -0.384701 -0.335097 -0.333980 -0.501008 -0.566868 -0.576282 0.218887 0.371977 -0.321619 -0.397882 -0.209670 -0.194865 -0.245116 0.225212 0.246680 0.238089 0.234845 0.234069 0.239394 0.250469 0.257722 0.265685 0.265750 0.264739 0.271134 0.302868 0.257869 0.231283 0.233392 0.232323
chargesum: 0.00000
title: Mulliken charges with hydrogens summed into heavy atoms:
elementType: Cl Cl O O N C C C C C C C C C C C C C
charge: -0.071988 -0.073888 -0.288464 -0.224144 -0.116816 0.087191 0.137837 0.139484 0.007183 -0.035433 -0.040409 0.218887 0.371977 -0.018751 -0.140012 0.021613 0.038527 -0.012794
polarizability: 2.34888289e+02 8.19028025e+00 1.84547093e+02 -4.49074128e+00 -1.79425989e+01 1.10543696e+02
1716.lowfreq: -8.2884 -6.3174 -1.4653 -0.0025 -0.0020 -0.0017 8.1155 10.8729 17.8947
frequency: 5.2738 10.3626 17.6005 27.3474 38.2245 49.1275 70.0885 77.2067 91.0120 106.1612 140.3032 177.1604 196.5584 204.1747 241.4137 253.7721 275.4502 326.7675 334.8195 382.2374 409.7373 449.7843 478.4250 499.7223 538.2843 574.7525 607.0001 659.5934 663.8951 694.2548 700.4196 752.0197 766.3956 769.2346 778.0396 781.8497 839.2991 846.2301 906.2964 926.3626 979.1357 986.9906 994.6346 997.3051 999.3787 1022.4508 1025.3338 1054.8817 1060.0973 1065.5489 1081.2290 1096.6102 1109.5404 1120.1154 1149.7057 1161.5723 1171.1162 1191.2125 1227.3501 1234.0924 1246.9220 1255.6825 1277.5099 1300.4203 1311.8799 1312.8473 1315.4289 1358.1787 1366.1648 1382.7488 1384.2464 1440.9375 1443.5039 1450.0625 1451.9834 1469.7410 1473.0957 1476.6124 1479.4796 1590.5295 1608.0959 1641.0912 2916.0091 2948.6389 2955.8454 2998.3374 3046.8168 3051.7506 3053.3543 3058.1416 3059.2552 3072.0035 3134.3336 3145.2904 3145.4449 3146.7529 3161.6010 3174.4649 3211.5226
redmass: 6.2459 7.1309 5.4843 8.7665 6.9073 5.1544 3.8762 2.5376 2.9341 2.7498 2.8366 6.2073 4.7996 4.3301 4.8993 5.1373 3.8661 6.7048 4.5510 4.1021 2.9413 3.3092 3.2229 3.0675 3.5073 5.2346 6.4142 6.7935 5.8747 2.2903 5.7309 5.0652 1.5063 1.1526 1.1815 1.3655 4.8618 1.2496 5.7804 1.3992 1.3593 6.1860 1.6750 1.3040 1.4544 2.2229 2.1058 2.5647 3.3803 3.7031 1.5309 1.9329 1.8316 2.0873 2.6064 1.2557 1.0657 1.3422 1.6412 1.3596 1.1906 1.3919 1.1684 1.2483 1.4271 1.3273 1.5291 1.3604 1.3223 3.3082 1.9344 1.2391 1.7955 1.0913 1.0929 2.1841 1.0882 1.0808 1.0840 6.3404 6.4797 10.1598 1.0704 1.0668 1.0668 1.0626 1.0926 1.0924 1.0868 1.0633 1.0607 1.0966 1.0855 1.1122 1.0904 1.1122 1.0950 1.0997 1.0947
irintensity: 0.1656 0.2616 0.3297 0.5117 2.6658 0.1266 0.4515 2.5384 1.5905 2.9299 0.4572 3.0842 7.4878 10.2431 1.6176 0.7439 2.3974 4.4519 4.7645 18.8243 0.1122 5.3655 3.4814 9.4093 2.0511 1.5363 1.3292 50.0162 139.5858 30.7256 20.8121 0.1961 94.3814 4.2069 11.4698 7.6716 12.8780 0.0463 33.9223 10.8788 0.0846 6.9780 31.2288 1.6063 6.1424 3.9002 31.0788 35.5153 37.1442 3.8086 16.2283 199.0487 11.8473 264.6657 221.0564 39.5781 1.4821 81.5670 21.7117 14.0107 22.8768 14.1475 8.3581 10.1075 9.3698 2.6932 91.2402 4.4997 2.4778 0.7887 41.7378 28.1137 2.5438 1.1209 7.3029 88.0057 13.0397 6.0904 14.9587 21.7644 12.0737 176.5957 56.0662 32.3519 55.7735 8.3451 1.6581 7.3219 15.6049 22.8643 26.1129 23.7288 0.0835 14.4904 15.7768 24.0193 24.7886 10.9315 4.1167
temp: 298.150 k
press: 1.00000 atm
elementType: 17 17 8 8 7 6 6 6 6 6 6 6 6 6 6 6 6 6 1 1 1 1 1 1 1 1 1 1 1 1 1 1 1 1 1
symmnumber: 1
zpe: 727997.5 jmol-1
zpe.correction: 0.277280 hartree
zpe.thermalcorrener: 0.296838 hartree
zpe.thermalcorrenthalpy: 0.297782 hartree
zpe.thermalcorrgfe: 0.221083 hartree
zpe.sumelectzpe: -1629.517754 hartree
zpe.sumelectthermal: -1629.498196 hartree
zpe.sumelectthermalent: -1629.497252 hartree
zpe.sumelectthermalfe: -1629.573951 hartree
dipole: 2.8341 0.7200 -0.2704
dipole: 2.9366
quadrupole: -120.7765 -139.4999 -120.8361
quadrupole: 0.7655 -4.3389 -2.7746
quadrupole: 6.2610 -12.4624 6.2014 0.7655 -4.3389 -2.7746
hfenergy: -1629.7950341 hartree
pointgroup: C01 [X(C13H17Cl2N1O2)]
dipole: -1.1087098 -0.3242396 -0.0211298 debye
polarizability: 234.4981623|10.0620146|188.9576853|-0.874044|3.3767773|106.5232298 unknown
InChI: InChI=1S/C13H17Cl2NO2/c14-7-10-16(11-8-15)9-6-13(17)18-12-4-2-1-3-5-12/h1-5H,6-11H2
charge 0 multiplicity 1
35 atoms
Cl 5.456956 3.10517 -1.372597
Cl 4.477715 -3.725309 0.526548
O  -1.758805 -0.445121 -0.141881
O  -0.993992 1.667374 0.575496
N  3.059124 0.170591 0.320491
C  1.712898 0.6693 0.670279
C  4.118565 1.193246 0.200803
C  3.457067 -1.126914 0.902112
C  0.599347 -0.103556 -0.069589
C  4.131877 1.756441 -1.228751
C  3.939037 -2.064422 -0.215397
C  -0.772344 0.504687 0.174443
C  -3.175316 -0.222616 -0.09379
C  -3.806409 0.978794 0.305557
C  -3.922832 -1.352624 -0.494455
C  -5.22057 1.025026 0.293936
C  -5.331109 -1.284337 -0.497898
C  -5.986438 -0.093449 -0.103244
H  1.528314 0.623765 1.768331
H  1.644631 1.734622 0.388695
H  3.984165 2.024207 0.92638
H  5.100586 0.734026 0.414877
H  2.59156 -1.587515 1.411892
H  4.257037 -1.017255 1.664957
H  0.574277 -1.170494 0.214713
H  0.803695 -0.076883 -1.158178
H  3.184171 2.246778 -1.497887
H  4.395517 0.988964 -1.970824
H  4.8269 -1.674815 -0.735992
H  3.138607 -2.294933 -0.933252
H  -3.217282 1.842737 0.613257
H  -3.392179 -2.260854 -0.795383
H  -5.720677 1.950075 0.601088
H  -5.913488 -2.158522 -0.807904
H  -7.080205 -0.039985 -0.105731
