program: Gaussian 09
title: 000169387
version: EM64L-G09RevD.01
frameworkgroup: C1[X(C17H36N)]
method: RPBEPBE
basis: SDD
operation: Freq
keyword: #p
keyword: freq=noraman
keyword: PBEPBE/SDD
title: #p freq=noraman PBEPBE/SDD
converged: YES YES NO NO
title: Mulliken charges:
elementType: N C C C C C C C C C C C C C C C C C H H H H H H H H H H H H H H H H H H H H H H H H H H H H H H H H H H H H
charge: -0.099074 -0.343486 -0.419135 -0.420608 -0.436274 -0.404174 -0.557745 -0.590951 -0.388167 -0.373240 -0.385683 -0.380358 -0.374016 -0.053023 -0.353015 -0.356251 -0.521451 -0.691681 0.295698 0.254787 0.221585 0.238927 0.214118 0.234377 0.276037 0.267370 0.229082 0.194226 0.261544 0.269743 0.266247 0.276517 0.264336 0.279957 0.216546 0.170819 0.206510 0.188333 0.183280 0.202168 0.200111 0.190607 0.186606 0.194641 0.257726 0.192082 0.187242 0.197211 0.193087 0.257721 0.236825 0.211982 0.221165 0.209116
chargesum: 1.00000
title: Mulliken charges with hydrogens summed into heavy atoms:
elementType: N C C C C C C C C C C C C C C C C C
charge: -0.099074 0.206999 0.041377 0.027887 0.107133 0.019134 0.239789 0.229859 -0.000802 0.021604 -0.000236 0.010361 0.007230 0.204703 0.026309 0.034047 -0.026905 -0.049417
polarizability: 2.17749305e+02 1.05957781e+01 1.73210008e+02 -8.25030505e+00 -3.39557381e+00 1.73197290e+02
1716.lowfreq: -10.9262 -3.3958 -0.0007 0.0006 0.0011 4.7767 9.9809 22.7964 23.8300
frequency: 9.0973 20.7331 23.0562 34.9990 44.6139 64.1848 72.6710 80.0097 88.9664 96.0881 114.5245 119.8991 133.2566 145.0705 162.2671 180.1615 212.4079 218.6464 235.7536 239.2177 250.9840 263.0401 287.5596 331.2195 344.0321 349.0201 371.5501 392.2831 425.4812 436.8893 461.4762 472.9303 501.3907 520.3440 642.1392 717.1992 719.0483 724.1976 736.5192 749.8661 773.0693 806.8453 824.8227 840.7357 865.7263 889.6642 894.7283 899.9423 936.2116 948.9024 956.8649 980.5464 984.5031 993.5801 1004.4893 1009.7293 1015.1587 1026.1714 1031.9872 1041.0336 1065.6788 1072.1782 1080.3113 1082.2842 1087.8936 1098.9273 1111.8618 1127.7389 1138.3402 1158.1485 1183.7179 1197.7649 1205.7474 1208.2304 1215.6286 1231.8356 1246.7871 1253.0554 1269.0038 1275.1006 1279.8504 1285.0273 1287.5628 1289.2629 1295.6823 1297.5028 1303.2685 1314.8337 1318.1140 1327.2081 1346.4801 1348.0483 1351.7949 1353.7955 1355.9276 1359.3400 1371.3562 1390.6217 1423.8780 1434.5779 1445.5433 1456.9414 1458.6682 1459.0935 1462.0126 1463.0290 1464.7506 1467.1924 1469.5755 1471.1138 1475.1984 1476.7226 1478.3427 1481.6821 1482.7579 1487.7303 1488.9982 1493.1732 1499.6705 1654.5648 2937.3786 2947.7054 2949.8612 2951.9160 2955.2326 2960.2184 2961.7932 2967.5847 2974.1020 2980.0161 2983.5116 2987.6258 2992.6858 2997.2861 3002.0693 3013.6270 3014.7588 3015.5700 3024.9065 3026.4039 3030.9990 3032.7883 3040.7595 3046.0002 3058.8457 3069.8606 3075.0727 3091.2145 3099.5735 3099.9813 3127.8190 3137.8943 3143.2367 3151.5174 3155.6657 3213.6693
redmass: 3.6520 3.1125 2.1941 2.4817 3.5022 2.9148 1.8927 2.3690 2.4340 2.4715 2.0623 2.4635 2.1123 2.0253 2.4651 2.6272 2.9103 1.2175 1.1087 2.5238 1.6791 2.5139 1.3022 2.6260 2.3328 2.4814 3.0610 2.3353 2.6213 2.6053 2.5637 2.7112 2.1436 2.3303 1.9259 1.0873 1.1018 1.1303 1.3882 1.7145 1.3245 1.2804 2.8520 1.4632 2.1410 1.8679 1.8454 1.7034 1.7848 1.9796 1.3915 2.1240 3.1190 2.5060 1.2736 1.2875 1.3074 2.3761 2.9689 1.5637 2.7242 1.6674 2.1969 2.0633 1.3637 2.5198 1.7942 1.9826 1.9194 1.6484 1.7994 1.6823 1.4844 1.4721 1.4920 1.4227 1.3479 1.3058 1.2686 1.2436 1.0408 1.2437 1.1576 1.1282 1.1119 1.1380 1.2103 1.3514 1.1931 1.2720 1.4368 1.3368 1.3448 1.6639 1.6144 1.5269 1.3516 1.2152 1.1458 1.1505 1.1589 1.0725 1.0735 1.0751 1.0795 1.0694 1.0793 1.0852 1.0797 1.0804 1.0597 1.0764 1.0433 1.0722 1.0845 1.0817 1.0877 1.0792 1.0585 4.3987 1.0619 1.0592 1.0591 1.0598 1.0608 1.0620 1.0653 1.0598 1.0361 1.0643 1.0940 1.0926 1.0943 1.0621 1.0999 1.0622 1.0854 1.0749 1.1006 1.0339 1.0338 1.1027 1.1037 1.1003 1.1009 1.1007 1.0993 1.1036 1.1046 1.0637 1.0952 1.1049 1.1047 1.1042 1.1046 1.1148
irintensity: 1.7144 0.6206 0.5503 0.4084 0.2715 0.1501 0.1845 0.0787 0.1624 1.2452 0.0532 0.3078 0.0622 0.0907 0.0976 0.1979 0.3806 0.2560 0.0037 1.0042 0.1661 0.5869 0.0421 0.7289 0.4615 0.0345 0.2659 0.4940 0.6210 1.7567 2.5250 1.6874 2.2865 0.7633 2.6315 19.8653 4.4654 6.3685 2.3815 1.1790 3.1210 4.8657 60.7425 7.1480 0.9264 8.1828 16.4490 12.0023 8.6450 8.8738 1.4289 4.9517 3.4613 8.3627 103.2645 0.4209 2.6352 2.2418 0.7256 0.8957 1.4320 2.3014 0.0647 0.4480 1.6492 7.0952 11.3182 1.6399 1.0177 0.5467 0.3906 4.1767 3.8195 6.6798 1.5182 0.7459 1.0507 0.5105 3.0879 1.5501 0.4106 2.8668 0.4555 3.4040 2.1579 1.6063 3.1671 3.7030 5.9683 5.6169 1.3603 0.0561 1.4809 0.5955 1.0690 2.8398 1.4286 11.3102 24.1706 11.8288 27.3289 0.3405 0.1042 0.2730 8.8077 1.7782 5.5045 9.5808 15.1405 0.7178 10.3720 1.3030 12.8507 4.8203 1.7199 15.9295 63.9779 18.7577 53.1901 2.1746 33.0069 4.9002 4.0748 0.6816 2.1019 20.2913 71.0596 133.0548 37.8377 25.7900 11.8766 10.2642 7.1750 18.5514 1.1518 9.8590 6.4026 1.7378 9.8568 5.5823 3.8822 4.2346 151.5361 123.5411 32.6139 88.8357 48.4280 1.4870 11.8715 3.7196 4.1938 3.6867 6.5572 2.6532 5.2851 5.3077
temp: 298.150 k
press: 1.00000 atm
elementType: 7 6 6 6 6 6 6 6 6 6 6 6 6 6 6 6 6 6 1 1 1 1 1 1 1 1 1 1 1 1 1 1 1 1 1 1 1 1 1 1 1 1 1 1 1 1 1 1 1 1 1 1 1 1
symmnumber: 1
zpe: 1313606.1 jmol-1
zpe.correction: 0.500326 hartree
zpe.thermalcorrener: 0.524459 hartree
zpe.thermalcorrenthalpy: 0.525403 hartree
zpe.thermalcorrgfe: 0.442500 hartree
zpe.sumelectzpe: -722.373358 hartree
zpe.sumelectthermal: -722.349225 hartree
zpe.sumelectthermalent: -722.348281 hartree
zpe.sumelectthermalfe: -722.431183 hartree
dipole: -18.2584 2.3143 1.6368
dipole: 18.4771
quadrupole: -21.0873 -99.5543 -104.1719
quadrupole: -11.5250 -9.5164 0.0545
quadrupole: 53.8505 -24.6165 -29.2341 -11.5250 -9.5164 0.0545
hfenergy: -722.8736837 hartree
pointgroup: C01 [X(C17H36N1)]
dipole: 7.1800493 -0.8368335 0.7691612 debye
polarizability: 217.2300864|10.9900676|173.4343915|8.9742667|3.6708121|173.4921248 unknown
InChI: InChI=1S/C17H36N/c1-5-7-8-9-10-11-12-13-14-15-17-18(3,4)16-6-2/h6H,2,5,7-17H2,1,3-4H3
charge 1 multiplicity 1
54 atoms
N  4.335336 -0.529049 0.728698
C  3.514062 0.470423 -0.12836
C  3.06695 1.754636 0.586273
C  2.337695 2.70231 -0.410999
C  4.636714 -1.802602 -0.137678
C  1.053795 2.128054 -1.061823
C  5.675352 0.078999 1.130173
C  3.566588 -0.928231 1.983771
C  -0.048201 1.708185 -0.061243
C  -1.350049 1.257831 -0.7629
C  -2.467172 0.836282 0.217755
C  -3.763168 0.390985 -0.497067
C  -4.891072 -0.020711 0.475575
C  3.416786 -2.60032 -0.523192
C  -6.183967 -0.465784 -0.244777
C  -7.316639 -0.871355 0.725661
C  3.000374 -2.742401 -1.806778
C  -8.604395 -1.312787 -0.00257
H  2.643719 -0.100131 -0.491184
H  4.153862 0.713822 -0.997131
H  3.933435 2.301157 1.003836
H  2.382334 1.521692 1.421785
H  3.048865 3.010649 -1.203816
H  2.075193 3.622742 0.144587
H  5.331218 -2.408718 0.472704
H  5.17394 -1.437784 -1.029579
H  0.641124 2.907185 -1.732185
H  1.296939 1.271827 -1.726101
H  6.248177 -0.66382 1.70703
H  5.504955 0.971578 1.748198
H  6.231792 0.355971 0.221599
H  3.514866 -0.06774 2.665515
H  4.095514 -1.759332 2.476188
H  2.549767 -1.239865 1.705554
H  -0.272067 2.559414 0.614542
H  0.308791 0.881192 0.591596
H  -1.720023 2.085253 -1.402603
H  -1.126416 0.414002 -1.44962
H  -2.103184 0.008521 0.863346
H  -2.697929 1.682216 0.897994
H  -4.124352 1.216214 -1.145443
H  -3.536069 -0.458571 -1.175027
H  -4.533762 -0.845509 1.127912
H  -5.123563 0.829943 1.149785
H  2.909008 -3.159347 0.273323
H  -6.541957 0.356861 -0.898613
H  -5.95608 -1.319374 -0.917304
H  -7.544721 -0.01785 1.396363
H  -6.960609 -1.693732 1.379719
H  2.153888 -3.388912 -2.060153
H  3.501337 -2.240061 -2.644027
H  -9.000382 -0.498593 -0.638337
H  -9.396872 -1.595927 0.71382
H  -8.412925 -2.184936 -0.655791
