program: Gaussian 09
title: 000169336
version: EM64L-G09RevD.01
frameworkgroup: C1[X(C12H15ClO4)]
method: RPBEPBE
basis: SDD
operation: Freq
keyword: #p
keyword: freq=noraman
keyword: PBEPBE/SDD
title: #p freq=noraman PBEPBE/SDD
converged: YES YES NO NO
title: Mulliken charges:
elementType: Cl O O O O C C C C C C C C C C C C H H H H H H H H H H H H H H H
charge: -0.060092 -0.298366 -0.261647 -0.217689 -0.450687 0.188716 -0.704069 -0.697163 0.230889 0.299577 -0.240082 -0.317658 -0.314165 -0.315380 -0.192116 -0.194807 -0.109932 0.218227 0.234742 0.248984 0.212774 0.229742 0.260969 0.215568 0.260821 0.257914 0.251005 0.193955 0.208174 0.253917 0.256006 0.351873
chargesum: 0.00000
title: Mulliken charges with hydrogens summed into heavy atoms:
elementType: Cl O O O O C C C C C C C C C C C C
charge: -0.060092 -0.298366 -0.261647 -0.217689 -0.098814 0.188716 -0.002116 0.006323 0.230889 0.299577 0.236306 -0.059744 -0.063160 0.086749 0.061801 0.061199 -0.109932
polarizability: 1.92831821e+02 -1.31298766e+01 1.59063233e+02 1.51435858e+01 1.61159402e+00 1.01560603e+02
1716.lowfreq: -8.3793 -6.5363 -4.7160 -0.0029 -0.0024 -0.0021 9.5786 17.4986 33.0412
frequency: 9.1066 17.0838 33.0244 50.1964 60.9781 72.6546 106.5304 143.2208 169.1971 193.0454 203.6055 218.4138 234.3369 247.6728 269.8491 278.8811 289.1000 315.3837 331.7539 371.9619 405.6602 417.1387 431.1044 448.7017 490.5919 509.0295 558.8449 623.3125 631.5376 697.3444 717.6302 737.8573 796.1583 817.0176 826.0800 838.6635 854.3279 863.4326 930.0851 941.8978 944.2373 956.7016 995.6079 999.9852 1007.7721 1045.6832 1061.8016 1065.1947 1092.0283 1105.7040 1142.9755 1157.2022 1190.1657 1191.0210 1221.9760 1228.1271 1244.7302 1260.2891 1277.0279 1356.5741 1357.6141 1378.7050 1389.7627 1395.0355 1417.2668 1448.3048 1450.3116 1458.9499 1462.0275 1463.3042 1466.6695 1480.7418 1582.1056 1588.5439 1621.0190 2947.1983 3001.4575 3003.0530 3004.3033 3019.1319 3090.1985 3098.4296 3104.8786 3111.1711 3126.3883 3157.3465 3157.6809 3175.7333 3179.4881 3583.7350
redmass: 5.2476 4.2402 9.0443 4.8482 6.3423 4.7804 4.5855 3.8974 4.3254 1.0370 1.1543 3.8070 1.5558 2.0545 4.5891 2.8309 3.9591 4.0258 3.1639 4.1368 5.1578 3.0398 4.3168 3.1420 3.9771 3.4656 3.4767 7.1175 4.8692 5.4564 5.2016 3.6029 4.3950 1.2542 3.7886 1.9584 2.8627 3.5151 1.9169 1.6860 1.3721 1.3504 3.9679 1.5670 1.8913 2.4837 1.9451 2.5195 1.3428 3.2884 2.4609 1.2971 2.2519 1.2542 1.2560 2.8962 3.2872 1.1283 1.2553 1.5757 3.8400 1.2300 3.5083 1.2302 1.5554 1.0775 1.0572 1.0585 1.3439 1.6275 1.0562 1.0582 8.0917 6.4838 10.9038 1.0574 1.0354 1.0969 1.0357 1.0662 1.1052 1.1001 1.0991 1.1011 1.1003 1.0884 1.0887 1.0969 1.0977 1.0667
irintensity: 1.1358 0.9703 0.4319 0.6755 1.5455 3.5201 3.6068 8.8540 2.5942 1.7787 152.1872 4.0768 1.7519 11.1938 6.0303 2.7982 11.9830 5.0278 4.2299 3.7380 6.2603 0.0981 6.6317 19.7400 9.9195 23.4216 10.9374 0.9258 35.3625 14.4225 6.7829 5.0725 8.3141 0.2363 13.5379 43.7370 23.6227 84.8301 10.1737 5.9473 3.2047 0.2376 49.6449 2.2782 20.3373 19.4900 51.0773 58.0873 39.1612 260.2108 189.0001 8.0664 57.7460 2.2624 18.8010 21.1391 20.2760 19.6016 1.2703 1.4769 0.1661 25.0996 1.3944 35.5716 0.4029 8.1143 15.7484 1.9610 79.4172 94.6075 4.8955 21.9379 0.4569 4.3881 151.9913 57.4580 6.8338 31.5846 18.7528 40.6274 16.7125 2.9996 35.8400 18.6840 11.6282 4.7801 1.0332 7.5720 0.3869 6.4615
temp: 298.150 k
press: 1.00000 atm
elementType: 17 8 8 8 8 6 6 6 6 6 6 6 6 6 6 6 6 1 1 1 1 1 1 1 1 1 1 1 1 1 1 1
symmnumber: 1
zpe: 648482.3 jmol-1
zpe.correction: 0.246994 hartree
zpe.thermalcorrener: 0.265547 hartree
zpe.thermalcorrenthalpy: 0.266491 hartree
zpe.thermalcorrgfe: 0.196653 hartree
zpe.sumelectzpe: -1225.912809 hartree
zpe.sumelectthermal: -1225.894256 hartree
zpe.sumelectthermalent: -1225.893312 hartree
zpe.sumelectthermalfe: -1225.963149 hartree
dipole: -2.3002 -1.2136 -1.5959
dipole: 3.0513
quadrupole: -110.7535 -87.5281 -115.0344
quadrupole: 13.1347 7.1938 4.1688
quadrupole: -6.3148 16.9106 -10.5957 13.1347 7.1938 4.1688
hfenergy: -1226.1598029 hartree
pointgroup: C01 [X(C12H15Cl1O4)]
dipole: 0.9485701 -0.3719643 0.634841 debye
polarizability: 189.309893|16.5840445|162.3910418|15.7360276|0.0294616|101.7547218 unknown
InChI: InChI=1S/C12H15ClO4/c1-12(2,11(15)16-8-7-14)17-10-5-3-9(13)4-6-10/h3-6,14H,7-8H2,1-2H3
charge 0 multiplicity 1
32 atoms
Cl -4.924097 -2.066358 -0.367567
O  -0.07934 1.251329 1.058401
O  2.064715 -0.35918 -0.029891
O  1.332803 0.47516 -2.071832
O  4.764905 -1.498232 0.440348
C  0.87826 1.767186 0.012429
C  0.18878 2.781556 -0.913242
C  2.004677 2.39663 0.848452
C  1.425398 0.581715 -0.827729
C  -1.198424 0.486213 0.638526
C  2.673999 -1.516358 -0.744045
C  -1.110179 -0.926626 0.65173
C  -2.427014 1.121235 0.33642
C  3.530369 -2.270033 0.256959
C  -2.244915 -1.70903 0.344373
C  -3.566173 0.34519 0.026911
C  -3.454033 -1.058736 0.030076
H  -0.22104 3.607202 -0.306685
H  0.916761 3.193263 -1.632821
H  -0.620347 2.312886 -1.496697
H  2.789659 2.812204 0.192387
H  1.585489 3.211908 1.462349
H  2.455917 1.640214 1.508562
H  1.860211 -2.150446 -1.142054
H  3.28218 -1.145961 -1.587165
H  -0.160375 -1.39519 0.925111
H  -2.492599 2.212929 0.36527
H  3.750318 -3.277475 -0.15867
H  2.972173 -2.39049 1.208613
H  -2.191464 -2.801472 0.356734
H  -4.521352 0.824838 -0.205104
H  5.268037 -1.846272 1.217751
