program: Gaussian 09
title: 000169403
version: EM64L-G09RevD.01
frameworkgroup: C1[X(C26H28N2O4)]
method: RPBEPBE
basis: SDD
operation: Freq
keyword: #p
keyword: freq=noraman
keyword: PBEPBE/SDD
title: #p freq=noraman PBEPBE/SDD
converged: YES YES NO NO
title: Mulliken charges:
elementType: O O O O N N C C C C C C C C C C C C C C C C C C C C C C C C C C H H H H H H H H H H H H H H H H H H H H H H H H H H H H
charge: -0.347195 -0.300171 -0.257865 -0.239602 -0.137695 -0.462386 -0.529375 0.011650 -0.389768 0.460676 -0.335615 -0.579855 -0.388772 -0.665136 0.358010 0.239411 -0.393084 -0.842183 0.251447 0.387993 -0.251369 -0.375886 -0.342059 0.485696 -0.197694 -0.223171 -0.252609 -0.447019 -0.354303 -0.194698 -0.210530 -0.254002 0.270568 0.240199 0.289383 0.226745 0.233414 0.257813 0.209496 0.269625 0.231988 0.243609 0.217816 0.216983 0.267657 0.237910 0.234237 0.232014 0.177505 0.327212 0.241233 0.250340 0.230673 0.226472 0.230946 0.222547 0.299855 0.229076 0.229925 0.231917
chargesum: 0.00000
title: Mulliken charges with hydrogens summed into heavy atoms:
elementType: O O O O N N C C C C C C C C C C C C C C C C C C C C C C C C C C
charge: -0.347195 -0.300171 -0.257865 -0.239602 -0.137695 -0.135175 -0.018608 0.301033 0.070391 0.460676 0.131694 -0.310230 -0.156784 0.013272 0.358010 0.239411 -0.125427 -0.138022 0.251447 0.387993 -0.073865 -0.134653 -0.091719 0.485696 0.032979 0.003302 -0.021663 -0.224472 -0.054448 0.034379 0.019396 -0.022085
polarizability: 4.12232845e+02 3.54114274e+00 3.21942784e+02 -5.86221355e+01 -8.63308429e-01 2.61861097e+02
1716.lowfreq: -4.1220 0.0002 0.0004 0.0006 1.3325 2.8184 10.3265 16.7973 21.4693
frequency: 10.1327 16.6852 21.4079 21.5635 28.1655 31.3812 45.7625 57.5323 66.5163 74.2117 78.6517 80.5583 90.3518 123.4823 126.5363 141.3089 159.0871 160.5987 176.4239 192.3245 212.1599 219.5342 225.4067 231.9469 240.6750 256.2649 267.7220 302.1440 329.5951 339.1826 354.2759 374.8543 390.7950 397.0600 406.7930 411.2995 449.8480 461.1533 487.8309 496.7115 500.9480 507.8660 522.5118 562.5317 582.0249 596.9325 607.1195 610.6614 612.3663 618.3527 636.6936 690.7204 692.5719 694.4276 696.4114 705.3577 736.0892 758.1704 766.9242 784.7059 790.1447 798.3550 808.6455 819.3237 822.2001 840.6363 847.2038 869.4575 876.4840 889.6073 906.8180 914.8109 936.2262 957.7555 962.0638 970.4668 972.6896 980.6379 984.2204 985.5568 991.2747 992.5895 994.9182 997.3392 1013.1359 1023.5693 1029.2138 1043.6071 1046.5709 1076.8074 1083.9682 1090.4392 1094.4400 1104.4836 1113.6701 1145.7002 1155.0111 1168.9795 1173.8924 1178.1864 1179.7720 1190.5083 1200.0348 1202.8624 1216.2391 1254.5847 1256.2186 1261.7733 1281.2708 1307.1330 1314.5628 1316.3126 1319.5981 1327.5419 1343.5341 1365.7649 1369.2641 1372.5826 1385.7450 1386.6403 1390.1432 1391.7351 1397.3658 1407.0628 1434.3825 1443.7335 1447.6578 1468.6029 1469.1560 1473.3729 1473.5836 1481.9413 1483.0344 1485.7510 1486.8141 1502.6342 1515.4435 1519.2541 1543.6053 1585.6490 1594.4932 1602.7100 1611.1361 1617.3319 1630.3680 1673.6552 2893.6333 2966.6432 2980.1089 2983.8317 3006.7620 3010.8867 3039.9733 3057.0928 3059.2414 3060.0246 3071.0375 3079.6815 3081.7134 3095.1705 3113.3459 3131.0402 3135.4150 3136.8043 3138.9744 3147.4104 3152.9073 3154.9560 3162.6952 3166.0999 3167.7468 3173.4212 3190.9477 3542.1145
redmass: 6.7503 5.0450 4.9785 5.4939 4.0380 3.8821 4.8438 3.6803 7.1638 5.0318 5.2494 5.1008 3.9146 5.7014 4.4894 1.1052 4.7924 3.7179 3.3673 3.7019 1.8922 3.2211 1.8196 4.3805 4.8509 3.9481 3.0092 3.0014 4.4194 6.2031 4.3391 3.5979 4.1032 4.2695 2.9057 2.9352 2.7908 2.8567 3.5228 3.3922 2.8868 2.8231 4.4538 5.6330 3.4920 3.7867 5.7367 6.0966 4.8079 5.9679 1.2909 2.1472 4.5776 4.1724 2.3163 6.0997 3.0680 1.6286 1.6650 5.1799 1.3898 3.0556 3.9746 1.4688 1.2673 1.2657 3.5121 4.1028 1.3922 1.4641 1.9344 1.4284 2.9375 1.5971 1.3791 4.3439 1.3615 5.7042 1.3289 5.8626 2.6330 2.8085 1.7817 1.3108 2.3582 2.0627 2.1159 1.5882 2.2944 2.0144 1.5292 1.5744 2.1136 2.3090 2.6312 1.8777 3.0252 1.0843 1.0504 1.5690 1.3157 1.1138 1.3886 1.7364 3.2288 1.8427 1.9289 2.0575 1.3172 1.4420 1.3173 1.2242 1.3018 1.3673 1.3012 2.3556 1.4440 1.6303 1.5430 6.3382 1.5278 3.0964 1.3155 2.0491 2.3437 2.3235 2.1737 1.0546 1.2316 1.0653 1.2661 1.3451 1.2489 2.2177 1.3351 1.2270 2.1095 2.2644 7.1095 5.3546 6.4563 5.2685 6.2944 6.0658 6.2622 9.3072 1.0837 1.0577 1.0371 1.0358 1.0604 1.0611 1.1014 1.0994 1.0957 1.0975 1.0987 1.0999 1.0989 1.1010 1.0888 1.0848 1.0869 1.0882 1.0886 1.0934 1.0905 1.0924 1.0956 1.0944 1.0995 1.1011 1.0954 1.0760
irintensity: 0.5823 0.3761 0.9034 0.2087 0.0123 0.1664 2.1555 0.6568 1.3377 0.8302 0.3970 2.3843 1.2656 4.8680 3.1169 2.1462 2.2942 0.9046 1.2578 4.6052 3.6320 0.6635 3.1481 0.5638 12.0875 8.0997 1.3433 3.0861 3.4579 2.2248 0.2571 15.8089 5.0810 14.4403 0.0122 0.3911 6.4886 9.6185 3.5505 5.8716 10.9543 28.1864 6.1429 8.0073 1.2113 4.4242 7.0546 2.5404 14.9250 4.8786 25.4569 28.3664 9.6065 1.2544 72.1214 22.5684 0.4599 88.0176 102.0411 23.3859 0.7421 30.2781 15.1808 40.1466 0.5061 0.3875 1.9796 3.6784 16.1634 12.1486 13.2465 12.6162 5.2512 3.1246 2.5370 109.7174 0.3310 65.0231 1.9124 3.1026 71.2731 69.0012 4.5282 1.9925 162.8021 29.1717 7.7167 12.5476 87.1508 62.2744 7.1438 48.7718 23.5339 65.1668 32.2316 25.1028 407.7175 7.3710 0.5762 16.1291 33.0991 6.5151 9.5619 59.8156 197.0710 4.5253 5.9247 209.4950 29.3001 24.9213 1.7751 18.8641 19.7511 46.6875 48.9702 5.1128 27.1073 84.8364 98.9309 33.2221 49.1960 22.2922 38.8340 6.1634 140.3377 2.5211 9.0862 21.5984 79.1432 13.4566 62.0747 1.5692 8.7560 15.1740 30.8859 26.6652 606.3354 83.7288 58.9841 587.3934 21.0311 29.9403 76.9560 93.5169 198.3004 253.6406 120.5014 29.2181 30.8633 27.9197 34.9662 31.2290 19.2226 6.6985 1.7206 15.1768 16.0766 41.2036 25.9180 41.7992 14.5049 4.0589 0.3591 0.4317 6.2687 26.9171 2.9801 30.6971 25.0224 19.9660 23.1182 7.2039 6.0498 27.2302
temp: 298.150 k
press: 1.00000 atm
elementType: 8 8 8 8 7 7 6 6 6 6 6 6 6 6 6 6 6 6 6 6 6 6 6 6 6 6 6 6 6 6 6 6 1 1 1 1 1 1 1 1 1 1 1 1 1 1 1 1 1 1 1 1 1 1 1 1 1 1 1 1
symmnumber: 1
zpe: 1272675.1 jmol-1
zpe.correction: 0.484736 hartree
zpe.thermalcorrener: 0.515491 hartree
zpe.thermalcorrenthalpy: 0.516435 hartree
zpe.thermalcorrgfe: 0.417516 hartree
zpe.sumelectzpe: -1415.650503 hartree
zpe.sumelectthermal: -1415.619748 hartree
zpe.sumelectthermalent: -1415.618804 hartree
zpe.sumelectthermalfe: -1415.717723 hartree
dipole: -6.3853 4.6338 5.5098
dipole: 9.6230
quadrupole: -192.0533 -201.5052 -184.7817
quadrupole: 35.8375 0.2560 -16.9486
quadrupole: 0.7268 -8.7251 7.9983 35.8375 0.2560 -16.9486
hfenergy: -1416.135239 hartree
pointgroup: C01 [X(C26H28N2O4)]
dipole: 3.0037316 0.4353836 -2.2631084 debye
polarizability: 387.0383294|-38.7495871|344.6387632|-54.9029399|27.9436973|264.3596331 unknown
InChI: InChI=1S/C26H28N2O4/c1-3-28(23-15-14-21(18-29)20(2)16-23)17-25(19-31-24-12-8-5-9-13-24)32-26(30)27-22-10-6-4-7-11-22/h4-16,18,25,27H,3,17,19H2,1-2H3
charge 0 multiplicity 1
60 atoms
O  1.484134 -0.710781 -1.116108
O  -0.016683 2.595762 -0.378073
O  2.206738 -0.740096 1.133835
O  -6.865589 -1.529567 2.232958
N  -1.583153 -1.018867 -1.562414
N  3.187781 -2.087533 -0.55682
C  -0.689535 0.12331 -1.803093
C  0.4287 0.275707 -0.752393
C  -1.329806 -2.252153 -2.340779
C  -2.660604 -0.911576 -0.677198
C  1.065551 1.676037 -0.754239
C  -2.849522 0.267273 0.118572
C  -3.611059 -1.976761 -0.52561
C  -2.135532 -2.324522 -3.659029
C  -3.921853 0.400456 1.020562
C  -4.860866 -0.674714 1.158307
C  -4.67331 -1.847454 0.371609
C  -4.039744 1.684189 1.831673
C  2.306476 -1.156256 -0.045298
C  0.28958 3.96769 -0.26683
C  -6.006663 -0.607229 2.078858
C  -0.79779 4.802422 0.088365
C  1.576704 4.513962 -0.487276
C  4.209953 -2.796626 0.139147
C  -0.593677 6.189776 0.222498
C  1.764145 5.909515 -0.347887
C  0.688287 6.752679 0.005019
C  5.012862 -3.688736 -0.62006
C  4.441607 -2.643985 1.531129
C  6.040568 -4.422528 0.005921
C  5.475775 -3.386213 2.141221
C  6.279488 -4.275786 1.392258
H  -1.264249 1.066022 -1.829585
H  -0.217279 0.002694 -2.795023
H  0.062562 0.0436 0.262916
H  -1.545903 -3.132843 -1.709321
H  -0.247918 -2.286527 -2.559689
H  1.884956 1.716307 -0.011733
H  1.457347 1.932015 -1.760507
H  -2.139048 1.096188 0.050096
H  -3.522635 -2.892459 -1.116262
H  -3.22172 -2.295496 -3.465474
H  -1.886657 -1.474124 -4.319548
H  -1.904651 -3.259616 -4.202379
H  -5.405166 -2.654915 0.490089
H  -4.016282 1.487013 2.919237
H  -4.982938 2.220749 1.617871
H  -3.203646 2.365878 1.599786
H  -6.102356 0.335136 2.670818
H  3.085804 -2.276589 -1.55634
H  -1.782017 4.351501 0.251522
H  2.425177 3.878461 -0.757538
H  -1.436545 6.833172 0.497894
H  2.760514 6.333365 -0.515994
H  0.84323 7.831236 0.111143
H  4.833547 -3.80736 -1.696508
H  3.820829 -1.959941 2.113152
H  6.653406 -5.107791 -0.58976
H  5.650788 -3.265952 3.216071
H  7.077388 -4.846118 1.878941
