program: Gaussian 09
title: 000169491
version: EM64L-G09RevD.01
frameworkgroup: C1[X(C23H26N2O6)]
method: RPBEPBE
basis: SDD
operation: Freq
keyword: #p
keyword: freq=noraman
keyword: PBEPBE/SDD
title: #p freq=noraman PBEPBE/SDD
converged: YES YES NO NO
title: Mulliken charges:
elementType: O O O O O O N N C C C C C C C C C C C C C C C C C C C C C C C H H H H H H H H H H H H H H H H H H H H H H H H H H
charge: -0.271001 -0.292014 -0.233773 -0.490514 -0.222453 -0.288742 -0.396694 -0.329000 -0.165621 -0.576654 -0.206820 0.483305 -0.401378 0.176180 -0.569051 0.513205 -0.506564 0.222329 -0.415138 -0.757657 -0.449121 -0.217803 0.513202 0.237410 -0.073461 -0.437975 -0.433083 -0.247192 -0.229370 -0.503185 -0.257976 0.299636 0.243922 0.225297 0.304293 0.250234 0.226428 0.419966 0.246758 0.242459 0.294652 0.242242 0.221402 0.226934 0.342255 0.233544 0.224794 0.178630 0.242822 0.234425 0.246256 0.283818 0.236104 0.248273 0.246468 0.250802 0.414193
chargesum: 0.00000
title: Mulliken charges with hydrogens summed into heavy atoms:
elementType: O O O O O O N N C C C C C C C C C C C C C C C C C C C C C C C
charge: -0.271001 -0.292014 -0.233773 -0.076322 -0.222453 -0.288742 0.023272 0.013255 0.134015 -0.107435 0.097474 0.483305 0.075283 0.176180 -0.322293 0.513205 0.030548 0.222329 -0.172896 -0.309322 -0.215577 0.006992 0.513202 0.237410 0.105169 -0.195153 -0.198658 -0.000936 0.054448 0.227661 -0.007174
polarizability: 3.07686093e+02 1.20251749e+01 2.66719056e+02 3.04862718e+00 2.34303573e+01 2.30824260e+02
1716.lowfreq: -10.3656 -6.9854 -0.0005 0.0002 0.0008 1.8674 12.8558 30.4147 33.8015
frequency: 11.7819 30.0142 33.7786 40.2350 49.3506 50.4000 51.8277 54.8642 58.9631 69.1111 76.7350 88.9966 97.6749 100.7872 110.3500 126.0416 144.2493 154.1535 168.8257 183.8230 186.0232 200.7744 219.6951 230.3162 243.5615 260.5063 274.9789 299.9601 320.0400 332.0520 352.8385 379.9591 399.4364 402.5579 426.3073 433.0650 453.0471 462.2874 469.3625 492.3173 522.6241 538.5767 547.1599 578.3407 601.4394 616.9463 632.1664 649.3518 667.9028 687.4305 703.4049 703.7857 708.1242 718.3621 726.1189 745.7008 766.5042 773.9257 784.6838 796.0715 807.9981 818.1581 827.4486 845.5105 861.2168 887.6335 909.9267 919.5720 921.4799 926.9852 934.8157 942.3170 955.8300 964.2087 966.0203 975.0772 985.7555 989.2072 990.5877 994.7520 1016.7841 1027.4650 1029.7094 1034.6255 1074.2215 1074.5406 1092.0648 1099.6729 1113.1645 1120.7524 1149.8747 1151.5457 1156.3555 1164.0754 1173.7076 1177.6327 1183.8202 1196.0628 1201.6879 1206.5135 1215.6514 1221.4412 1237.7726 1244.7939 1253.7172 1288.0985 1292.4002 1303.5517 1312.0663 1320.2505 1325.4658 1329.6864 1346.0558 1347.8139 1354.4712 1365.8521 1375.9758 1383.3442 1421.9394 1436.8886 1441.2252 1452.5028 1459.7400 1461.2478 1464.3736 1465.5485 1470.2149 1472.1272 1478.1061 1484.6789 1533.4355 1587.7898 1594.8603 1603.5008 1606.4618 1614.4957 1626.6855 1635.2152 1672.9773 2944.7918 2992.0006 2993.2288 3001.4324 3008.4191 3012.3816 3016.4392 3045.0449 3049.3776 3068.8002 3079.8599 3090.9033 3112.2465 3112.6269 3118.0551 3119.0976 3121.7484 3130.2857 3147.3843 3153.1503 3153.5097 3160.5263 3176.6935 3333.3548 3364.0473 3468.0848
redmass: 5.6168 5.0541 8.2115 6.1864 5.5265 5.4892 6.2108 6.8157 5.0871 5.5204 5.4974 8.1650 3.4199 1.2921 6.8428 4.3278 5.5002 4.7467 4.5173 4.5426 6.1300 3.8630 3.8093 3.9860 3.3027 4.2521 4.3201 5.8287 4.0126 3.7595 2.7628 3.9116 2.8669 2.2993 3.2249 2.9814 4.1250 3.2414 3.9429 4.5713 4.2307 4.2122 5.1601 5.1262 4.3512 6.2617 4.6241 4.6118 1.6998 1.3262 2.6698 3.1830 2.6552 2.3949 1.9315 2.7851 2.3682 2.9335 3.1828 2.7278 1.3997 2.8647 2.0234 2.5094 1.2495 2.7367 1.4989 1.7802 2.0461 2.4366 1.6740 2.3714 2.8303 2.3719 2.0313 1.3807 1.3633 5.6873 5.9600 1.3466 2.6947 2.2864 2.5733 2.7982 1.8939 3.3003 1.8043 2.2261 1.2662 2.6279 1.5600 2.8271 1.2866 1.4751 1.2201 1.0670 1.0960 1.1079 1.6448 2.7496 1.3742 1.4491 1.5723 1.7284 1.7329 1.6153 1.4909 1.5002 1.4201 1.2697 1.3908 1.2947 1.4181 1.4920 1.4729 1.2947 8.5626 6.1032 1.1831 2.4207 2.2565 1.0501 1.3015 1.1044 1.0798 1.4643 1.1939 1.1268 2.2938 2.0056 1.8958 6.0165 6.0366 5.9939 5.4336 6.1974 5.4335 9.1362 8.4474 1.0867 1.0801 1.0597 1.0598 1.0296 1.0631 1.0625 1.0855 1.1023 1.1019 1.1019 1.1014 1.0912 1.1045 1.0870 1.0896 1.0890 1.0913 1.0893 1.0992 1.1052 1.0944 1.1009 1.0826 1.0657 1.0781
irintensity: 0.0288 0.2306 1.1558 0.4011 0.4616 0.1006 1.7121 0.0661 1.0584 0.5628 2.9069 8.2637 1.3893 1.1244 1.0835 2.6261 0.5779 11.7395 12.1184 4.7124 12.3766 13.4281 4.9962 8.7479 10.3062 16.0669 14.4543 13.0890 1.5583 11.0022 4.0788 1.6012 0.4433 1.4982 6.8665 6.2159 6.7610 5.1819 23.5924 5.8532 8.9531 14.6939 4.9697 6.8448 18.8938 0.3193 4.4376 3.9918 19.6685 73.5551 15.1971 10.2584 38.6525 54.5062 113.7948 16.6971 33.5640 10.1800 35.6391 21.6154 37.5947 22.4062 31.2933 4.2774 0.3518 3.2005 2.3322 15.2469 1.0629 12.6057 15.7424 6.5829 58.5503 22.7314 3.6031 2.0014 1.6042 1.1316 0.2336 0.7411 44.6072 4.3954 30.1888 10.6573 1.0796 5.7025 22.9108 144.0348 0.5138 35.0076 58.5660 197.2902 2.2964 1.0625 1.8829 0.0651 0.1282 0.7507 8.0951 0.6936 9.8439 9.5735 1.3876 12.4618 9.4933 36.1329 1.0319 17.7974 39.5244 10.2900 12.5102 1.0537 9.0357 43.7248 4.4808 45.0405 0.2491 0.4737 16.8639 11.9245 1.8156 14.7489 125.7301 10.5487 22.8033 119.5210 27.0994 6.9039 14.3633 15.8302 230.2355 9.6289 13.5360 5.2342 363.1724 5.4750 99.4941 181.0928 209.3614 141.0011 26.2619 35.0610 19.2766 28.7928 19.0573 21.0418 6.3276 9.7923 8.8331 9.2278 6.4069 7.2305 24.1500 6.9507 12.3375 8.0374 19.4870 6.5926 27.2327 11.8490 7.6368 6.1552 301.3605 280.4806 80.9019
temp: 298.150 k
press: 1.00000 atm
elementType: 8 8 8 8 8 8 7 7 6 6 6 6 6 6 6 6 6 6 6 6 6 6 6 6 6 6 6 6 6 6 6 1 1 1 1 1 1 1 1 1 1 1 1 1 1 1 1 1 1 1 1 1 1 1 1 1 1
symmnumber: 1
zpe: 1192403.9 jmol-1
zpe.correction: 0.454163 hartree
zpe.thermalcorrener: 0.484378 hartree
zpe.thermalcorrenthalpy: 0.485322 hartree
zpe.thermalcorrgfe: 0.389849 hartree
zpe.sumelectzpe: -1450.673500 hartree
zpe.sumelectthermal: -1450.643284 hartree
zpe.sumelectthermalent: -1450.642340 hartree
zpe.sumelectthermalfe: -1450.737813 hartree
dipole: 5.0495 1.0487 -0.7821
dipole: 5.2163
quadrupole: -176.5172 -171.4044 -186.0067
quadrupole: 2.4073 10.5700 1.3533
quadrupole: 1.4589 6.5717 -8.0306 2.4073 10.5700 1.3533
hfenergy: -1451.1276623 hartree
pointgroup: C01 [X(C23H26N2O6)]
dipole: 1.8711828 -0.8283418 0.1555591 debye
polarizability: 301.1235835|-17.9946912|269.0509342|-2.8447403|27.5405545|235.0548908 unknown
InChI: InChI=1S/C23H26N2O6/c1-31-23(30)20(25-22(29)19(24-15-26)10-11-21(27)28)14-18-9-5-8-17(13-18)12-16-6-3-2-4-7-16/h2-9,13,15,19-20,24-25,27H,10-12,14H2,1H3
charge 0 multiplicity 1
57 atoms
O  4.644168 0.441285 -0.393848
O  1.247563 3.115531 1.850719
O  2.860841 1.278254 -1.627663
O  -0.754106 0.231638 -1.35718
O  -1.931277 1.093387 -3.1657
O  -3.616493 2.575854 1.558438
N  1.17226 1.146266 0.594566
N  -1.432339 3.392463 1.754523
C  2.582626 0.821985 0.803531
C  2.791178 -0.518801 1.582464
C  -0.845042 2.561038 0.692398
C  2.160301 -1.735764 0.920408
C  -0.940476 3.298719 -0.683392
C  0.619422 2.296436 1.099453
C  0.818823 -2.091412 1.203253
C  0.199702 -3.213197 0.596491
C  -0.362349 2.550727 -1.921805
C  3.328922 0.870571 -0.54131
C  2.898393 -2.535792 0.008336
C  -1.25904 -3.556737 0.91247
C  0.956284 -3.996835 -0.309053
C  2.298132 -3.65884 -0.600352
C  -2.247438 -2.550113 0.320515
C  -1.102556 1.269051 -2.249507
C  -2.755005 3.322984 2.112942
C  -2.568908 -2.586371 -1.063937
C  -2.833278 -1.539726 1.12456
C  -3.460168 -1.639052 -1.624317
C  -3.709183 -0.576757 0.56739
C  5.484825 0.512627 -1.616725
C  -4.028259 -0.629534 -0.808747
H  2.999232 1.63959 1.427086
H  3.878727 -0.662602 1.70265
H  2.356551 -0.365443 2.587051
H  -1.411983 1.61559 0.635663
H  -2.009173 3.52559 -0.852721
H  -0.407039 4.263951 -0.594002
H  0.603893 0.571479 -0.050945
H  0.246215 -1.482237 1.91495
H  -0.463248 3.210894 -2.799351
H  0.709556 2.321855 -1.780773
H  3.942909 -2.282596 -0.208986
H  -1.481875 -4.568375 0.525234
H  -1.397563 -3.593629 2.009703
H  -0.759451 3.961803 2.283288
H  0.499187 -4.876749 -0.778293
H  2.877118 -4.277781 -1.295101
H  -3.004468 3.999817 2.960939
H  -2.129351 -3.364298 -1.700532
H  -2.598882 -1.501183 2.195954
H  -3.700158 -1.677131 -2.691971
H  -4.115211 0.228296 1.187871
H  6.470723 0.14562 -1.30009
H  5.542524 1.553664 -1.97514
H  5.054572 -0.121614 -2.409468
H  -4.694303 0.12054 -1.246468
H  -1.322428 -0.581538 -1.50387
