program: Gaussian 09
title: 000169316
version: EM64L-G09RevD.01
frameworkgroup: C1[X(C10H14N4O2)]
method: RPBEPBE
basis: SDD
operation: Freq
keyword: #p
keyword: freq=noraman
keyword: PBEPBE/SDD
title: #p freq=noraman PBEPBE/SDD
converged: NO YES NO NO
title: Mulliken charges:
elementType: O O N N N N C C C C C C C C C C H H H H H H H H H H H H H H
charge: -0.263475 -0.267537 -0.153905 -0.226261 -0.370082 -0.088629 -0.358140 -0.350971 0.107291 0.110720 -0.344185 0.223218 0.150996 -0.698111 -0.600296 -0.209209 0.232843 0.243346 0.214809 0.220031 0.202015 0.198155 0.341135 0.212746 0.217823 0.215104 0.267349 0.251444 0.251080 0.270697
chargesum: 0.00000
title: Mulliken charges with hydrogens summed into heavy atoms:
elementType: O O N N N N C C C C C C C C C C
charge: -0.263475 -0.267537 -0.153905 -0.226261 -0.028947 -0.088629 0.118049 0.083869 0.107291 0.110720 0.055985 0.223218 0.150996 -0.052438 0.169577 0.061488
polarizability: 1.72313159e+02 4.94880762e-01 1.65713127e+02 1.42410844e+01 6.18176231e-01 8.64078412e+01
1716.lowfreq: -13.7703 -6.4291 -0.0011 -0.0008 -0.0008 2.8256 16.8423 45.1716 58.5520
frequency: 13.9006 45.1370 58.4681 97.0675 102.1064 107.6432 119.1191 168.6221 192.4429 225.7462 234.5783 280.8747 291.6923 304.0523 344.5485 348.2833 394.7541 431.6694 457.6864 485.5740 577.3863 603.3665 656.3807 661.2056 686.0747 705.5729 734.4179 743.8914 753.9665 800.7330 809.5927 899.1926 900.0126 918.1831 946.9461 979.9309 1016.0818 1050.0635 1072.6991 1081.3206 1111.5617 1114.8864 1129.6539 1168.6627 1209.5494 1227.6991 1232.7941 1250.8776 1272.0677 1287.6451 1291.4582 1313.3202 1345.5642 1360.0764 1368.9062 1379.9267 1386.8163 1404.9358 1424.3415 1448.5823 1468.4323 1472.8585 1475.8178 1476.2379 1476.4135 1486.9904 1513.0317 1572.9844 1614.0849 1654.7395 2967.5608 2974.8221 2988.3121 3012.4407 3012.8575 3030.0856 3049.0856 3072.9606 3075.2821 3101.4223 3105.5286 3138.0285 3249.2664 3587.8953
redmass: 3.3434 5.6679 1.7009 2.6814 2.3595 1.5084 3.0193 7.0092 4.2006 1.1406 3.9905 3.1309 4.9048 3.4897 4.2466 4.4031 7.9216 4.6877 5.5099 9.3674 7.8667 4.1937 3.0442 3.9010 1.7076 9.5049 1.2402 9.8197 1.8947 1.6392 1.4397 1.9339 2.5686 2.9069 2.9691 2.3057 3.7616 3.3138 2.5132 2.2339 2.3316 2.4194 1.3081 2.1773 2.4366 2.2291 2.4003 2.4724 1.2911 3.9738 1.0974 1.5016 1.4473 2.1060 1.6174 3.7458 1.2259 3.1568 1.2446 1.1113 1.0705 1.0433 1.0555 1.0621 1.0777 1.0815 4.5606 9.2292 9.9889 10.5667 1.0585 1.0365 1.0588 1.1004 1.0326 1.0590 1.1033 1.1011 1.0994 1.1064 1.1022 1.1026 1.0993 1.0827
irintensity: 0.2746 0.3430 0.1176 1.3256 0.5827 2.3709 1.1614 1.6974 10.8302 0.7241 6.5569 13.9132 1.4987 5.7024 11.1284 9.8605 8.2801 7.4533 10.1119 10.3961 2.7456 21.1912 34.7405 18.8277 75.6982 6.7492 7.3507 7.6398 3.1020 1.0084 18.6832 5.2299 1.9041 1.8368 14.1658 14.0973 26.5581 44.3833 0.4266 11.0600 6.0669 15.2715 0.1535 13.6872 18.6007 26.0788 21.0895 41.2934 2.2079 29.6360 5.6577 27.0643 1.0636 64.0116 43.8290 13.1867 9.7503 74.3847 89.9697 21.3825 0.3847 17.7878 9.5879 6.3883 5.7839 16.9611 117.8930 4.1412 570.8408 416.6545 29.9833 31.5439 27.9975 5.6495 25.8543 25.8996 9.6956 65.9930 53.2607 10.6657 16.5175 0.7425 2.0742 96.3549
temp: 298.150 k
press: 1.00000 atm
elementType: 8 8 7 7 7 7 6 6 6 6 6 6 6 6 6 6 1 1 1 1 1 1 1 1 1 1 1 1 1 1
symmnumber: 1
zpe: 631672.8 jmol-1
zpe.correction: 0.240591 hartree
zpe.thermalcorrener: 0.256140 hartree
zpe.thermalcorrenthalpy: 0.257084 hartree
zpe.thermalcorrgfe: 0.195941 hartree
zpe.sumelectzpe: -757.765626 hartree
zpe.sumelectthermal: -757.750077 hartree
zpe.sumelectthermalent: -757.749133 hartree
zpe.sumelectthermalfe: -757.810277 hartree
dipole: -0.1543 3.4417 0.2364
dipole: 3.4532
quadrupole: -97.9541 -87.4500 -95.4785
quadrupole: 6.9667 -1.5033 0.5599
quadrupole: -4.3266 6.1775 -1.8510 6.9667 -1.5033 0.5599
hfenergy: -758.0062175 hartree
pointgroup: C01 [X(C10H14N4O2)]
dipole: 0.0447911 1.35432 -0.097999 debye
polarizability: 172.5446512|-0.3779277|165.6988088|13.5632401|-0.727927|86.1906677 unknown
InChI: InChI=1S/C10H14N4O2/c1-3-4-5-14-8-7(11-6-12-8)9(15)13(2)10(14)16/h6,11H,3-5H2,1-2H3
charge 0 multiplicity 1
30 atoms
O  0.401436 -2.530111 0.51254
O  -3.640567 -0.380272 -0.661379
N  0.393205 -0.187613 0.507013
N  -1.598249 -1.444425 -0.064229
N  -2.069475 2.261509 -0.232606
N  0.120181 2.282081 0.396864
C  1.827272 -0.131368 0.891307
C  2.767722 -0.112119 -0.333436
C  -0.333204 0.969497 0.276558
C  -1.680332 0.923689 -0.110504
C  4.251598 -0.05184 0.094112
C  -0.223024 -1.447291 0.324736
C  -2.422623 -0.293187 -0.312033
C  5.211569 -0.026861 -1.114969
C  -2.212744 -2.782351 -0.227678
C  -0.964206 3.03508 0.079029
H  1.966517 0.782006 1.495331
H  2.031025 -1.020252 1.511596
H  2.527346 0.764629 -0.965646
H  2.591917 -1.021607 -0.939428
H  4.485165 -0.926515 0.734451
H  4.418344 0.849877 0.718061
H  -3.002144 2.573911 -0.502723
H  5.016386 0.852744 -1.756607
H  6.267312 0.017891 -0.790882
H  5.086301 -0.932242 -1.737715
H  -3.260735 -2.627049 -0.523187
H  -2.155756 -3.342154 0.719911
H  -1.672901 -3.354715 -0.99949
H  -0.975235 4.121856 0.067102
