program: Gaussian 09
title: 000169283
version: EM64L-G09RevD.01
frameworkgroup: C1[X(C19H16)]
method: RPBEPBE
basis: SDD
operation: Freq
keyword: #p
keyword: freq=noraman
keyword: PBEPBE/SDD
title: #p freq=noraman PBEPBE/SDD
converged: YES YES NO NO
title: Mulliken charges:
elementType: C C C C C C C C C C C C C C C C C C C H H H H H H H H H H H H H H H H
charge: 0.294834 -0.686626 0.166671 0.497683 0.292378 -0.371068 -0.387789 -0.245994 -0.256552 -0.463904 -0.370494 -0.413241 -0.369206 -0.224820 -0.233082 -0.230616 -0.245159 -0.248700 -0.243267 0.250425 0.215923 0.247800 0.249932 0.227810 0.227586 0.231969 0.240555 0.248178 0.241072 0.223909 0.224038 0.225950 0.227106 0.226917 0.229784
chargesum: 0.00000
title: Mulliken charges with hydrogens summed into heavy atoms:
elementType: C C C C C C C C C C C C C C C C C C C
charge: 0.294834 -0.220278 0.166671 0.497683 0.292378 -0.123268 -0.137857 -0.018184 -0.028966 -0.231936 -0.129939 -0.165063 -0.128134 -0.000911 -0.009044 -0.004666 -0.018053 -0.021783 -0.013483
polarizability: 2.47295972e+02 -1.93863560e+01 1.91844232e+02 1.78289829e+01 1.53892763e+01 1.57519084e+02
1716.lowfreq: -14.0697 -11.0181 -0.0006 -0.0004 0.0002 3.0904 17.5026 20.4971 52.2578
frequency: 15.6504 20.3917 52.1938 61.9056 87.5259 97.6655 177.9595 205.3921 225.9784 290.8539 304.1687 333.9032 384.2329 403.1336 405.9445 455.3168 470.4826 515.4415 553.3458 566.3822 611.1635 613.5396 617.1127 620.2833 703.0883 706.2845 713.5869 736.3974 753.5929 754.0015 781.8507 812.1726 827.2600 853.6402 854.3199 877.6049 912.4011 921.4984 943.5183 965.2580 975.6225 975.7170 987.7169 989.7776 990.9103 993.8617 993.9874 996.6148 1026.1413 1034.2792 1051.1005 1078.0114 1080.9823 1104.7017 1170.9073 1172.3394 1174.5714 1186.4392 1187.3532 1190.9064 1194.8676 1216.5401 1266.3435 1284.7023 1300.1532 1318.9733 1332.7876 1368.2403 1371.2990 1381.5327 1423.7182 1438.8253 1439.7826 1461.3403 1469.9793 1483.6602 1495.0925 1572.5475 1584.9328 1592.6852 1608.8897 1610.8000 1614.0798 2974.1238 3032.0590 3114.1407 3118.8194 3120.8104 3121.7113 3126.2926 3129.0395 3132.3859 3139.6232 3142.1959 3143.0685 3148.0277 3160.5594 3161.4108 3164.1398
redmass: 4.2048 3.8407 4.3680 4.0843 4.5825 4.0576 4.3407 4.4279 4.2740 4.3434 4.2591 2.6752 3.6850 2.8071 2.8705 3.2604 3.1335 4.0841 3.5398 4.6214 5.6315 5.7790 6.2953 5.6323 2.1528 1.7594 3.1285 2.3499 1.4949 2.5658 1.8020 3.0970 4.1481 1.2497 1.2446 1.3393 1.4746 1.4170 1.6891 1.5331 1.3905 1.3918 5.6293 1.6775 3.2255 1.3426 1.3079 6.3998 2.2173 2.0996 2.2033 1.6549 1.6029 1.8694 1.0579 1.0530 1.0659 1.3766 1.2689 1.1344 1.3925 2.2668 1.9377 1.9429 1.7540 1.3399 1.3286 4.0068 7.4406 7.8540 2.2111 2.2124 2.1711 1.2605 1.9205 2.1920 2.7594 6.1007 6.3849 6.0646 6.1697 6.1352 6.1296 1.0631 1.0960 1.0866 1.0865 1.0848 1.0845 1.0874 1.0888 1.0913 1.0922 1.0942 1.0960 1.0964 1.1009 1.1015 1.1016
irintensity: 0.0069 0.0447 0.0907 0.1115 0.5761 0.0697 2.5670 0.5712 0.7852 0.4013 0.9640 1.2879 1.4495 0.1584 0.0664 5.0466 9.5882 8.0862 5.9437 0.7980 1.2111 3.6519 1.8069 6.0128 25.7856 55.9793 16.6263 17.7755 124.8106 20.7470 18.4504 5.1951 0.3613 0.2331 0.2218 0.9926 2.8554 2.6344 1.6760 3.0238 0.3069 0.2955 0.2871 0.2226 0.2314 0.3080 0.1657 9.4021 8.0627 1.7502 8.2739 0.2537 20.7967 4.2967 0.1559 0.0169 0.4642 0.3080 0.7000 0.5421 2.2342 0.0963 0.8517 1.5964 2.6100 1.9581 1.3465 1.2866 0.1723 0.3968 10.5105 3.5986 8.6566 28.2371 19.2645 17.4605 6.6354 0.6482 2.7358 0.9242 6.7877 6.1192 8.5697 17.8408 6.9334 8.6911 3.0079 5.1329 2.9420 0.3332 5.7676 13.4655 22.3220 16.6126 44.8671 42.1549 37.8591 27.0922 19.8907
temp: 298.150 k
press: 1.00000 atm
elementType: 6 6 6 6 6 6 6 6 6 6 6 6 6 6 6 6 6 6 6 1 1 1 1 1 1 1 1 1 1 1 1 1 1 1 1
symmnumber: 1
zpe: 749631.3 jmol-1
zpe.correction: 0.285519 hartree
zpe.thermalcorrener: 0.300807 hartree
zpe.thermalcorrenthalpy: 0.301751 hartree
zpe.thermalcorrgfe: 0.240152 hartree
zpe.sumelectzpe: -732.329077 hartree
zpe.sumelectthermal: -732.313790 hartree
zpe.sumelectthermalent: -732.312845 hartree
zpe.sumelectthermalfe: -732.374444 hartree
dipole: 0.1919 -0.1898 -0.0196
dipole: 0.2706
quadrupole: -102.1769 -107.8786 -104.7599
quadrupole: -2.7910 3.9341 4.0065
quadrupole: 2.7616 -2.9401 0.1786 -2.7910 3.9341 4.0065
hfenergy: -732.6145963 hartree
pointgroup: C01 [X(C19H16)]
dipole: -0.0729157 -0.0720929 0.0287034 debye
polarizability: 243.5410144|28.4291179|181.578658|14.5647435|-21.0150903|171.5396162 unknown
InChI: InChI=1S/C19H16/c1-3-9-16(10-4-1)15-18-13-7-8-14-19(18)17-11-5-2-6-12-17/h1-14H,15H2
charge 0 multiplicity 1
35 atoms
C  0.05535 0.975594 0.172377
C  0.709562 -0.189442 0.926267
C  -1.300406 0.929698 -0.284598
C  2.161542 -0.467408 0.544698
C  -2.216164 -0.228691 -0.032686
C  0.825479 2.137671 -0.09371
C  -1.816776 2.03761 -1.014625
C  0.294142 3.235893 -0.800587
C  -1.037021 3.182392 -1.272979
C  3.187365 -0.45149 1.522033
C  2.509512 -0.782487 -0.795544
C  -2.959891 -0.795413 -1.104414
C  -2.41511 -0.756187 1.272878
C  4.527349 -0.745837 1.175763
C  3.844098 -1.07812 -1.146081
C  -3.861637 -1.859146 -0.88244
C  -3.319652 -1.816677 1.498176
C  4.860357 -1.061592 -0.160444
C  -4.045501 -2.375985 0.420997
H  0.110778 -1.104383 0.761337
H  0.664742 0.010247 2.015988
H  1.867359 2.164851 0.24543
H  -2.858386 2.002655 -1.354254
H  0.913466 4.120493 -0.986775
H  -1.464865 4.024739 -1.827772
H  2.935763 -0.208887 2.562342
H  1.727346 -0.790135 -1.564366
H  -2.811279 -0.40951 -2.119766
H  -1.88099 -0.311611 2.120111
H  5.306574 -0.728528 1.946371
H  4.093704 -1.322624 -2.185025
H  -4.416167 -2.286595 -1.725559
H  -3.462574 -2.200927 2.514488
H  5.896813 -1.291461 -0.432177
H  -4.745385 -3.200806 0.595144
