program: Gaussian 09
title: 000013081
version: EM64L-G09RevD.01
frameworkgroup: C1[X(C11H16ClO2PS3)]
method: RPBEPBE
basis: SDD
operation: Freq
keyword: #p
keyword: freq=noraman
keyword: PBEPBE/SDD
title: #p freq=noraman PBEPBE/SDD
converged: YES YES NO NO
title: Mulliken charges:
elementType: Cl S S S P O O C C C C C C C C C C C H H H H H H H H H H H H H H H H
charge: -0.047596 0.056094 0.250594 -0.232837 0.600177 -0.473149 -0.460461 -0.223872 -0.218897 -0.831534 -0.220477 -0.650810 -0.651078 -0.213423 -0.188020 -0.199672 -0.207638 -0.097931 0.233650 0.238068 0.220848 0.237618 0.312032 0.343128 0.235366 0.234151 0.214388 0.228793 0.238330 0.212033 0.262486 0.271739 0.262751 0.265152
chargesum: 0.00000
title: Mulliken charges with hydrogens summed into heavy atoms:
elementType: Cl S S S P O O C C C C C C C C C C C
charge: -0.047596 0.056094 0.250594 -0.232837 0.600177 -0.473149 -0.460461 0.247845 0.239569 -0.176374 -0.220477 0.033094 0.028078 0.049063 0.083720 0.063079 0.057514 -0.097931
polarizability: 2.66470986e+02 -1.18613736e+01 2.21809923e+02 1.42346741e+01 1.83697665e+01 1.74881861e+02
1716.lowfreq: -10.4779 -5.1943 -2.8785 0.0029 0.0033 0.0033 8.2123 17.3860 18.5673
frequency: 6.6546 17.2168 18.4822 28.3552 36.9111 50.7011 56.9334 60.7130 66.3222 83.5326 97.4919 123.7367 150.0667 157.2673 184.7928 201.2284 228.6687 239.6259 240.1959 256.6080 281.7256 290.1495 300.4979 321.8133 327.5255 347.0998 405.6822 410.8810 432.8929 490.2766 504.3161 542.8258 611.5196 619.1401 638.9683 668.8397 699.9810 708.0860 714.8733 811.7441 813.3310 820.6400 828.7953 847.6775 862.7665 886.5183 954.2671 968.5962 990.7612 1014.5913 1026.4960 1066.6788 1072.4947 1098.0767 1102.5368 1107.5687 1133.3783 1135.4611 1147.3337 1178.5739 1231.6284 1255.6294 1257.6810 1281.9640 1352.7501 1357.7325 1357.9201 1375.7454 1394.9908 1395.9367 1400.5951 1454.1826 1456.0717 1456.9675 1474.5671 1476.8827 1486.6478 1488.6330 1572.3748 1576.4906 2981.1969 2990.0222 2996.9294 2997.1715 3046.9946 3054.7977 3055.6119 3092.7359 3093.7128 3110.6195 3112.3580 3151.6826 3153.2051 3161.4739 3174.7989 3180.8631
redmass: 6.1142 5.4202 5.4046 3.7207 2.9656 7.3619 2.4579 4.2951 2.0328 4.2957 7.9602 6.7712 4.5739 7.9432 4.4656 5.4190 3.9417 1.4419 1.7240 2.3180 6.7834 5.0344 13.0460 5.3169 5.1219 6.5094 8.6681 2.9116 5.7437 4.4422 4.6284 12.6936 8.2324 7.1609 8.0340 6.2678 3.8727 8.0541 7.1414 1.0883 1.0927 1.3986 1.2398 1.5359 4.5803 3.5147 1.3284 1.3688 5.7695 2.3701 2.8694 5.8342 2.0290 1.3695 2.2415 2.2046 1.4251 1.4237 1.0344 1.1154 1.1024 1.1414 1.1340 1.2359 1.2618 3.5852 1.3761 3.9726 1.2317 1.2374 1.0785 2.1842 1.0405 1.0406 1.0516 1.0519 1.0784 1.0778 6.3483 7.9128 1.0561 1.0538 1.0382 1.0371 1.1075 1.0549 1.1078 1.0979 1.0983 1.1019 1.1023 1.1124 1.0892 1.0891 1.0969 1.0979
irintensity: 0.2946 0.0819 0.1945 0.0620 1.7473 0.0942 0.2444 0.5070 4.8353 1.5685 0.2432 7.4980 0.5747 1.3134 0.7222 2.8111 1.3131 0.6069 1.8908 0.5470 13.9723 1.9501 1.4406 4.0478 0.6901 4.0631 68.8032 0.1990 1.5445 25.6304 32.9595 146.1736 7.3578 0.0447 26.6338 62.7092 1.3105 86.3018 9.3860 2.9015 7.2341 64.3899 0.9053 27.7537 264.2263 32.2279 0.1149 0.3302 57.1531 168.8833 30.2963 27.8804 14.4640 7.4203 10.7415 2.5162 0.0421 10.2782 3.8797 2.9908 26.1831 0.7904 0.2944 0.7195 11.4406 1.3040 5.2904 8.7571 25.8358 25.8965 7.9207 74.8262 11.2767 17.8901 7.1535 5.3518 9.2175 16.0753 18.5632 1.2215 28.5523 18.5747 25.0507 14.9075 10.6531 7.4712 10.5844 18.4283 26.3336 26.1768 35.1292 1.8102 0.7985 0.8796 2.7376 0.2220
temp: 298.150 k
press: 1.00000 atm
elementType: 17 16 16 16 15 8 8 6 6 6 6 6 6 6 6 6 6 6 1 1 1 1 1 1 1 1 1 1 1 1 1 1 1 1
symmnumber: 1
zpe: 657649.7 jmol-1
zpe.correction: 0.250486 hartree
zpe.thermalcorrener: 0.273583 hartree
zpe.thermalcorrenthalpy: 0.274527 hartree
zpe.thermalcorrgfe: 0.191142 hartree
zpe.sumelectzpe: -2573.293054 hartree
zpe.sumelectthermal: -2573.269957 hartree
zpe.sumelectthermalent: -2573.269013 hartree
zpe.sumelectthermalfe: -2573.352397 hartree
dipole: -0.2782 1.1813 2.1277
dipole: 2.4495
quadrupole: -139.3508 -149.0644 -144.7205
quadrupole: -8.8725 -2.8503 0.6810
quadrupole: 5.0278 -4.6858 -0.3420 -8.8725 -2.8503 0.6810
hfenergy: -2573.5435392 hartree
pointgroup: C01 [X(C11H16Cl1O2P1S3)]
dipole: 0.1292104 -0.2986605 0.9071182 debye
polarizability: 251.3935041|-28.1995033|222.9384564|-24.7298401|-19.7578945|188.8308103 unknown
InChI: InChI=1S/C7H6ClS2.C4H10O2PS/c8-6-1-3-7(4-2-6)10-5-9;1-3-5-7(8)6-4-2/h1-4H,5H2;3-4H2,1-2H3
charge 0 multiplicity 1
34 atoms
Cl -4.470534 2.845049 -0.003883
S  1.095228 -1.635168 -1.327868
S  -1.194776 -2.709145 0.519215
S  3.223366 1.114803 -2.513358
P  2.474108 0.15573 -0.846775
O  1.582673 1.065485 0.330742
O  3.577903 -0.489402 0.328831
C  0.681516 2.152765 -0.164076
C  4.726953 -1.291316 -0.188007
C  0.58044 -2.086716 0.449371
C  -2.105077 -1.110393 0.363055
C  0.192731 2.887139 1.079895
C  5.541422 -1.688902 1.038945
C  -2.528948 -0.431487 1.529624
C  -2.415296 -0.592609 -0.916367
C  -3.256746 0.776246 1.423948
C  -3.138493 0.617294 -1.034009
C  -3.543942 1.281587 0.140437
H  -0.155459 1.696192 -0.725643
H  1.257957 2.813162 -0.839043
H  4.334958 -2.174734 -0.729773
H  5.311765 -0.66695 -0.889776
H  1.20727 -2.91704 0.802815
H  0.70082 -1.19701 1.084577
H  1.039514 3.324197 1.634949
H  -0.355982 2.202606 1.748346
H  -0.493134 3.701354 0.780818
H  4.936153 -2.294283 1.734715
H  5.899678 -0.793623 1.57408
H  6.418186 -2.285599 0.726317
H  -2.29668 -0.843762 2.516572
H  -2.09335 -1.127553 -1.814082
H  -3.592232 1.306772 2.319479
H  -3.38319 1.02651 -2.018271
