program: Gaussian 09
title: 000169268
version: EM64L-G09RevD.01
frameworkgroup: C1[X(C13H22O2)]
method: RPBEPBE
basis: SDD
operation: Freq
keyword: #pfreq=noraman
keyword: PBEPBE/SDD
title: #p freq=noraman PBEPBE/SDD
converged: YES YES NO NO
title: Mulliken charges:
elementType: O O C C C C C C C C C C C C C H H H H H H H H H H H H H H H H H H H H H H
charge: -0.276163 -0.276647 0.018095 -0.470843 0.421466 -0.538697 -0.327358 -0.308509 -0.308317 -0.472495 -0.831946 -0.273736 0.366214 -0.784633 -0.792255 0.224798 0.218456 0.216049 0.199113 0.221847 0.249157 0.228353 0.210398 0.231501 0.210425 0.207394 0.206307 0.232495 0.222765 0.226425 0.230478 0.211888 0.215218 0.229609 0.217089 0.225800 0.220260
chargesum: 0.00000
title: Mulliken charges with hydrogens summed into heavy atoms:
elementType: O O C C C C C C C C C C C C C
charge: -0.276163 -0.276647 0.242893 -0.036338 0.421466 -0.117738 -0.078201 0.130242 0.133610 -0.058794 -0.150261 -0.043258 0.366214 -0.127919 -0.129106
polarizability: 1.86636775e+02 -3.14600255e+00 1.51120812e+02 1.88376521e+00 -3.25391954e+00 1.13578370e+02
1716.lowfreq: -9.4818 0.0005 0.0007 0.0007 6.1160 6.8634 17.0801 24.2881 31.3706
frequency: 12.8318 23.6021 30.7563 35.3003 47.3374 53.8963 93.7069 111.4792 122.5776 155.0701 192.7646 193.6792 233.5513 250.6535 274.9603 302.1193 313.7347 366.3998 404.9717 413.3164 448.7312 474.2918 491.1492 528.7972 555.9612 612.1041 663.2674 736.4782 761.3736 782.5292 837.7009 846.5315 856.1382 884.6805 894.5614 920.1529 930.0267 948.0525 962.6658 979.3565 990.0596 995.5097 1009.9595 1029.6899 1036.4581 1045.9844 1081.9076 1087.9376 1108.1041 1116.3218 1121.5112 1155.2613 1158.5574 1180.8078 1188.7192 1194.7074 1228.9594 1241.9924 1249.2408 1290.7615 1298.2814 1323.9747 1325.1039 1328.1379 1351.0433 1365.9923 1371.8973 1388.2121 1396.3569 1399.1338 1441.2806 1452.6554 1456.8838 1459.8647 1465.6448 1470.8157 1472.8037 1473.4653 1474.6450 1475.0031 1477.3983 1686.7466 1694.4035 2952.1369 2955.0344 2958.2761 2962.0073 2967.9451 2981.6423 2984.6673 2990.2305 2998.2268 3025.3855 3027.6434 3029.4741 3035.2575 3039.6344 3060.2339 3074.8587 3081.2763 3090.4587 3090.9483 3091.6303 3095.2353 3100.8765
redmass: 3.7503 2.6946 4.1735 3.0634 3.2458 3.6787 3.2633 1.1905 1.2634 1.5500 1.3254 2.7417 2.4905 2.5896 2.6791 2.8008 2.6018 2.3545 2.5573 2.2397 2.4276 2.6630 3.0436 2.6871 2.0789 2.3450 6.4686 2.3455 2.8780 3.5049 1.3247 1.7768 2.3150 4.0581 1.6695 2.3620 2.0868 1.4155 2.3473 2.8336 2.1773 1.2554 2.6254 1.7528 2.2461 1.6265 1.6662 2.7793 2.1578 2.1095 2.1882 1.3886 1.1538 1.2727 1.4894 1.2688 1.6116 1.6373 1.2476 1.3236 1.3581 1.2896 1.3660 1.3521 1.3189 1.4479 1.4313 1.2976 1.2813 1.2240 1.0910 1.0720 1.0565 1.0930 1.0506 1.0895 1.0465 1.0709 1.0810 1.0963 1.0601 6.8495 6.5765 1.0641 1.0376 1.0628 1.0396 1.0404 1.0689 1.0685 1.0625 1.0812 1.0970 1.0930 1.0959 1.0962 1.0973 1.0965 1.0938 1.0931 1.0957 1.0916 1.0983 1.0935 1.1033
irintensity: 0.5486 0.9814 1.0078 5.7261 3.4607 0.3828 0.3215 0.7501 0.6697 2.8564 0.1036 1.0529 1.2097 2.2797 1.7584 1.6293 4.9392 0.6710 1.2561 0.8357 11.3600 6.3914 5.9235 11.2138 8.7248 4.0225 4.2974 1.1411 20.8346 18.0191 13.9083 10.0554 1.7487 23.7343 17.4119 27.5982 17.7318 0.3093 2.8914 12.4740 5.3142 2.7086 21.2922 38.7177 75.9262 11.6239 3.3064 78.1245 0.2608 62.2809 17.7480 1.3322 2.3102 7.7340 1.4487 12.7879 5.7040 3.3323 1.6809 6.8535 1.6363 6.3873 0.7973 0.6013 30.0411 1.0268 1.0408 28.3885 21.9982 9.8652 10.1046 8.7977 0.3873 8.9438 17.0104 5.6488 17.2504 19.5364 7.7169 1.2278 16.1074 4.1063 7.8891 20.5088 38.5395 49.5608 58.1202 51.9841 16.2791 61.8507 53.8469 87.3275 8.4334 27.7898 49.3850 27.8620 43.9016 20.8104 4.7243 48.6829 32.7649 12.3507 27.9729 45.9939 35.5186
temp: 298.150 k
press: 1.00000 atm
elementType: 8 8 6 6 6 6 6 6 6 6 6 6 6 6 6 1 1 1 1 1 1 1 1 1 1 1 1 1 1 1 1 1 1 1 1 1 1
symmnumber: 1
zpe: 842784.3 jmol-1
zpe.correction: 0.321000 hartree
zpe.thermalcorrener: 0.339044 hartree
zpe.thermalcorrenthalpy: 0.339989 hartree
zpe.thermalcorrgfe: 0.270837 hartree
zpe.sumelectzpe: -657.767186 hartree
zpe.sumelectthermal: -657.749142 hartree
zpe.sumelectthermalent: -657.748197 hartree
zpe.sumelectthermalfe: -657.817349 hartree
dipole: 0.6221 -0.4551 0.2820
dipole: 0.8207
quadrupole: -77.7858 -88.6112 -95.7499
quadrupole: -6.2761 3.8469 0.5114
quadrupole: 9.5965 -1.2289 -8.3676 -6.2761 3.8469 0.5114
hfenergy: -658.0881861 hartree
pointgroup: C01 [X(C13H22O2)]
dipole: 0.2484152 -0.1758156 0.107896 debye
polarizability: 186.7513171|-2.4089863|151.1112216|1.9998632|-2.4921635|113.4734182 unknown
InChI: InChI=1S/C13H22O2/c1-11(2)5-4-6-12(3)7-8-13-14-9-10-15-13/h5,7,13H,4,6,8-10H2,1-3H3
charge 0 multiplicity 1
37 atoms
O  2.772924 -1.070098 0.864988
O  3.860669 -0.107133 -1.018567
C  2.554542 -0.227272 -0.341492
C  2.053367 1.179839 0.012065
C  -0.44625 1.812922 0.242613
C  -1.746517 1.662527 1.029848
C  0.677207 1.149271 0.644274
C  4.237414 -1.237241 1.010739
C  4.732386 -1.156007 -0.443469
C  -2.924362 1.024434 0.225855
C  -0.515852 2.741641 -0.958039
C  -2.641686 -0.403757 -0.197762
C  -3.500265 -1.464336 -0.198681
C  -3.038614 -2.839722 -0.657432
C  -4.956003 -1.3985 0.231624
H  1.834784 -0.783463 -0.974437
H  2.073842 1.781161 -0.914405
H  2.793782 1.62435 0.706992
H  -2.07746 2.666124 1.372724
H  -1.564143 1.052473 1.934545
H  0.603683 0.504906 1.533315
H  4.407502 -2.212987 1.492743
H  4.664248 -0.423795 1.629819
H  5.771746 -0.808978 -0.553425
H  4.587531 -2.117404 -0.9752
H  -3.125942 1.652173 -0.668372
H  -3.838741 1.079061 0.845718
H  -1.197652 2.341814 -1.734024
H  -0.921173 3.728915 -0.660288
H  0.464898 2.908619 -1.431716
H  -1.610516 -0.583039 -0.540074
H  -3.645963 -3.201252 -1.51169
H  -3.154841 -3.588772 0.151681
H  -1.979149 -2.833254 -0.967355
H  -5.16598 -2.151746 1.017049
H  -5.248849 -0.409167 0.619426
H  -5.624868 -1.636908 -0.619887
