program: Gaussian 09
title: 000169237
version: EM64L-G09RevD.01
frameworkgroup: C1[X(C9H21NO3Si)]
method: RPBEPBE
basis: SDD
operation: Freq
keyword: #p
keyword: freq=noraman
keyword: PBEPBE/SDD
title: #p freq=noraman PBEPBE/SDD
converged: YES YES NO NO
title: Mulliken charges:
elementType: Si O O O N C C C C C C C C C H H H H H H H H H H H H H H H H H H H H H
charge: 1.543654 -0.592752 -0.575632 -0.579879 -0.284408 -0.922154 -0.336785 -0.350386 -0.419626 -0.476448 -0.491523 -0.487584 -0.074297 -0.571541 0.251986 0.252097 0.206559 0.226103 0.172299 0.204234 0.248596 0.213665 0.189568 0.227201 0.213163 0.223413 0.207382 0.215554 0.238664 0.236529 0.213838 0.206467 0.237822 0.217406 0.216814
chargesum: 0.00000
title: Mulliken charges with hydrogens summed into heavy atoms:
elementType: Si O O O N C C C C C C C C C
charge: 1.543654 -0.592752 -0.575632 -0.579879 -0.035812 -0.418071 0.095877 0.026147 -0.016392 0.187329 0.170077 0.169249 0.163525 -0.137321
polarizability: 1.75423289e+02 8.39628661e+00 1.26957204e+02 8.02389493e+00 -1.06071056e+00 1.10029994e+02
1716.lowfreq: -4.0123 -0.0018 -0.0017 -0.0016 3.9503 16.6694 22.0261 29.1327 41.4413
frequency: 17.2482 28.7224 41.3992 49.3347 53.4668 57.8616 67.7142 72.4768 82.9207 95.1566 99.8050 109.6338 122.0458 127.7459 136.7425 152.2102 172.2092 206.0043 228.8438 254.7751 295.3318 339.8062 368.7274 384.1617 436.3989 466.7628 565.6263 634.8649 683.2428 691.5849 712.7611 756.5640 787.1619 833.2771 912.5389 941.5403 953.5407 1000.7802 1009.4564 1015.6468 1044.6384 1050.7246 1063.0587 1067.8170 1071.2576 1120.5342 1122.3859 1122.7943 1124.2214 1142.0987 1144.0936 1146.3868 1150.2655 1172.1419 1214.2394 1239.5551 1263.0291 1274.1398 1289.5021 1303.1039 1338.1364 1380.2247 1429.6459 1430.3089 1442.4867 1447.0233 1449.8062 1451.1011 1468.5461 1469.0593 1472.6291 1473.8357 1474.5677 1476.4371 1477.7239 1480.5443 1494.7633 1659.6402 2841.5397 2866.8349 2942.3639 2944.4850 2957.9413 2974.3318 2974.8512 2986.5583 2992.6422 3023.7236 3026.7844 3030.3152 3044.9411 3054.0639 3086.0724 3087.0209 3088.3138 3090.9147 3109.1619 3195.8895 3437.2788
redmass: 2.9171 3.8477 3.5600 2.0970 2.2010 3.4310 1.5536 1.9522 2.8675 1.2047 1.0403 2.0347 2.3022 3.0343 3.7292 3.2279 2.7033 4.3585 4.0929 3.1126 5.1780 5.8575 3.5478 3.4198 4.6129 2.3536 5.0930 1.6280 2.7501 1.3354 8.4260 1.3636 5.3272 1.4273 1.3796 1.8444 1.4649 2.4505 1.1333 1.8438 5.7670 5.4353 2.7513 4.2925 2.4718 1.2530 1.3138 1.2527 1.2982 4.1466 1.4056 1.4322 1.4882 1.7126 1.2743 1.3739 1.2472 1.2401 1.0882 1.2235 1.3770 1.4206 1.2109 1.0850 1.1234 1.1219 1.1141 1.1890 1.0536 1.0529 1.0796 1.0595 1.0526 1.0624 1.0528 1.0706 1.0881 4.7042 1.0713 1.0696 1.0329 1.0332 1.0311 1.0875 1.0659 1.0685 1.0725 1.1028 1.1027 1.0990 1.1036 1.1013 1.0599 1.0995 1.0994 1.1017 1.0944 1.1141 1.0745
irintensity: 0.6228 2.9293 0.1299 2.3685 5.2688 1.0586 1.4386 3.5069 0.0676 1.7148 0.4089 0.2853 6.5008 5.3292 15.9200 6.3372 8.7022 6.3162 5.3653 5.5735 8.2549 16.2117 13.7485 17.4704 31.1444 3.3992 30.8069 18.7882 20.9605 105.9056 117.1347 47.7970 81.0252 26.4834 9.3417 31.9914 60.1530 3.7815 30.0828 14.3694 272.9954 426.6470 11.7934 26.4710 11.9669 0.1282 1.2080 1.2948 2.3134 74.8516 16.5162 74.3978 1.1343 4.9477 40.9603 6.0439 1.9552 0.4858 0.9481 25.3107 2.7680 2.7159 14.5063 12.2849 1.3855 0.4400 4.2600 34.3462 10.8646 10.2305 2.9664 7.4990 7.5698 1.8058 3.9312 3.3528 7.2731 11.0041 88.0918 123.4819 135.2866 25.4785 81.3408 31.5532 3.3822 7.0898 57.4314 51.0678 79.4036 4.5994 49.7543 52.1367 13.1555 34.3111 39.0332 32.8521 10.4144 30.8132 0.7394
temp: 298.150 k
press: 1.00000 atm
elementType: 14 8 8 8 7 6 6 6 6 6 6 6 6 6 1 1 1 1 1 1 1 1 1 1 1 1 1 1 1 1 1 1 1 1 1
symmnumber: 1
zpe: 772575.8 jmol-1
zpe.correction: 0.294259 hartree
zpe.thermalcorrener: 0.315270 hartree
zpe.thermalcorrenthalpy: 0.316214 hartree
zpe.thermalcorrgfe: 0.240013 hartree
zpe.sumelectzpe: -924.212094 hartree
zpe.sumelectthermal: -924.191083 hartree
zpe.sumelectthermalent: -924.190138 hartree
zpe.sumelectthermalfe: -924.266340 hartree
dipole: 0.0844 -0.6243 2.0057
dipole: 2.1023
quadrupole: -89.4528 -82.6621 -101.7109
quadrupole: 2.3555 2.8883 0.3232
quadrupole: 1.8225 8.6132 -10.4356 2.3555 2.8883 0.3232
hfenergy: -924.5063527 hartree
pointgroup: C01 [X(C9H21N1O3Si1)]
dipole: 0.0294781 0.2250749 -0.7953293 debye
polarizability: 175.6667225|-7.8680326|126.639661|-7.8000042|-1.622667|110.1041034 unknown
InChI: InChI=1S/C9H21NO3Si/c1-5-7-10-8-6-9-14(11-2,12-3)13-4/h5,10H,1,6-9H2,2-4H3
charge 0 multiplicity 1
35 atoms
Si 2.354596 0.052921 0.00134
O  3.606524 0.126653 -1.183648
O  2.596241 -1.247363 1.100467
O  2.415957 1.406667 1.06099
N  -3.012669 -0.130842 0.002829
C  0.732699 -0.056956 -0.967361
C  -0.526943 -0.079321 -0.06416
C  -1.832353 -0.086681 -0.884734
C  -4.320346 -0.179323 -0.690561
C  5.041905 0.103624 -0.904762
C  2.325652 -2.653578 0.827598
C  2.557861 2.798115 0.651777
C  -5.446601 -0.357875 0.30562
C  -6.543415 0.436623 0.382541
H  0.693551 0.807451 -1.660216
H  0.763064 -0.960036 -1.608568
H  -0.518801 0.802927 0.608956
H  -0.522721 -0.96838 0.595195
H  -1.834086 0.797628 -1.574335
H  -1.855878 -0.988045 -1.530702
H  -2.99055 0.620003 0.706881
H  -4.295627 -1.0561 -1.371769
H  -4.522155 0.715798 -1.330423
H  5.553827 -0.057746 -1.867668
H  5.378058 1.065441 -0.470494
H  5.306289 -0.71268 -0.20484
H  1.304742 -2.811116 0.422412
H  3.061389 -3.077964 0.115856
H  2.409432 -3.184763 1.789699
H  2.691879 3.387602 1.573502
H  3.437416 2.949421 -0.005847
H  1.653564 3.163152 0.122682
H  -5.321213 -1.199734 1.001652
H  -7.334758 0.254708 1.1184
H  -6.682831 1.29107 -0.29211
