program: Gaussian 09
title: 000013079
version: EM64L-G09RevD.01
frameworkgroup: C1[X(C12H10Cl2N2)]
method: RPBEPBE
basis: SDD
operation: Freq
keyword: #p
keyword: freq=noraman
keyword: PBEPBE/SDD
title: #p freq=noraman PBEPBE/SDD
converged: YES YES NO NO
title: Mulliken charges:
elementType: Cl Cl N N C C C C C C C C C C C C H H H H H H H H H H
charge: -0.079107 -0.073191 -0.443183 -0.425935 0.503945 0.572375 -0.338278 -0.449361 -0.326342 -0.345282 -0.055563 -0.167782 -0.215760 -0.210507 -0.282722 -0.254959 0.304571 0.315158 0.285836 0.225346 0.261858 0.228141 0.251499 0.228328 0.256677 0.234236
chargesum: 0.00000
title: Mulliken charges with hydrogens summed into heavy atoms:
elementType: Cl Cl N N C C C C C C C C C C C C
charge: -0.079107 -0.073191 -0.138611 -0.110777 0.503945 0.572375 -0.052442 -0.224014 -0.326342 -0.083424 -0.055563 0.060359 0.035739 0.017822 -0.026045 -0.020723
polarizability: 2.05294574e+02 -1.89337648e+01 1.47352147e+02 -3.91272296e+00 -1.10481555e+00 1.33165432e+02
1716.lowfreq: -4.3539 -2.4961 -0.0022 -0.0010 0.0014 7.0284 19.9439 22.1384 30.8085
frequency: 19.8272 22.1056 30.7976 121.3716 155.8457 170.8890 178.1814 194.7236 248.0102 279.7189 318.0652 325.6896 371.2797 384.6061 389.1869 434.5077 438.9079 508.4134 526.6345 542.3987 574.7099 594.3794 643.7902 666.6133 679.0923 684.3222 707.5446 750.5400 768.8482 818.3993 848.6108 864.7573 870.9838 876.0326 929.9249 959.0155 973.4793 974.2372 1004.7880 1034.7103 1065.3146 1084.9248 1118.2272 1165.0781 1173.5954 1176.9263 1240.9775 1272.7542 1284.8928 1340.2524 1373.4852 1383.4392 1422.7606 1432.1327 1451.8925 1467.8284 1484.7876 1505.2893 1576.4063 1583.6298 1617.3684 1620.5568 3123.3791 3139.1528 3150.1265 3154.5702 3165.0397 3178.0269 3179.4713 3183.0645 3501.4478 3510.8951
redmass: 7.8733 9.0415 6.0035 5.2083 7.4319 7.1338 5.9258 5.2526 5.4853 6.6443 5.6516 1.0939 6.1955 12.3156 9.9513 3.3121 3.0838 1.4206 6.2085 3.1022 2.7833 6.2410 6.2701 7.2632 3.3365 3.1443 3.6227 1.2405 1.4335 5.2891 1.3902 1.4192 1.4876 5.8106 1.3600 1.3236 1.6989 2.8410 7.1851 1.9899 2.0387 1.6135 1.6800 1.2435 1.0889 1.9034 1.7673 1.3310 1.8562 2.4728 4.9803 4.5082 2.7018 2.6511 2.0501 1.8566 2.6610 1.9695 5.3968 5.3486 6.2022 6.7709 1.0879 1.0858 1.0936 1.0894 1.0944 1.1005 1.0923 1.0965 1.0780 1.0769
irintensity: 0.6753 0.4735 1.1396 1.6723 4.3452 1.1770 1.3987 2.2354 1.7222 3.3237 3.6350 119.8333 4.9088 7.9504 4.2793 4.0915 4.6902 94.4984 2.1890 16.7934 27.9669 1.8316 11.3503 17.7654 5.3310 34.8932 2.5755 94.5526 66.4959 7.7898 7.4302 0.8246 21.0869 58.6332 2.6423 1.3030 1.8796 9.1103 58.0981 12.1812 21.3420 3.4416 6.3801 0.2219 4.8004 4.0003 22.8668 3.1061 53.5088 4.7096 55.0069 10.6390 2.1287 10.1222 98.8638 24.8669 99.5768 87.2257 31.7230 35.1633 287.2006 49.3502 11.4742 3.3158 18.8406 6.2075 10.7377 12.7291 1.1410 3.3433 28.2187 55.8986
temp: 298.150 k
press: 1.00000 atm
elementType: 17 17 7 7 6 6 6 6 6 6 6 6 6 6 6 6 1 1 1 1 1 1 1 1 1 1
symmnumber: 1
zpe: 502513.1 jmol-1
zpe.correction: 0.191397 hartree
zpe.thermalcorrener: 0.205816 hartree
zpe.thermalcorrenthalpy: 0.206760 hartree
zpe.thermalcorrgfe: 0.147205 hartree
zpe.sumelectzpe: -1491.747444 hartree
zpe.sumelectthermal: -1491.733025 hartree
zpe.sumelectthermalent: -1491.732081 hartree
zpe.sumelectthermalfe: -1491.791636 hartree
dipole: -0.6127 -3.6233 -0.2662
dipole: 3.6844
quadrupole: -105.1940 -103.0007 -104.1736
quadrupole: -8.5619 -5.2479 1.4916
quadrupole: -1.0712 1.1221 -0.0508 -8.5619 -5.2479 1.4916
hfenergy: -1491.9388407 hartree
pointgroup: C01 [X(C12H10Cl2N2)]
dipole: 0.212913 -1.2845243 0.6370927 debye
dipolederiv: -0.1694727 -0.02904 0.0145598 -0.0834867 -0.4485358 -0.3491737 -0.0088149 -0.3408172 -0.4077572 -0.1641708 0.0417825 -0.0573645 0.1378798 -0.5309107 0.3470169 -0.1403509 0.33757 -0.352824 -0.8533197 0.1684443 -0.2645468 0.5435012 -0.011848 -0.2335666 -0.3154452 -0.1338373 -0.4831721 -0.8065108 0.1450114 0.2656882 0.5185515 -0.089034 0.193009 0.3283802 0.1275929 -0.4825328 1.3661259 -0.0982818 0.4428638 -0.3888639 0.0735553 -0.0389328 0.7907904 -0.0358968 0.3816046 1.044439 -0.090617 -0.4472247 -0.4002521 -0.143171 -0.1318675 -0.9076 -0.1615668 0.323291 -0.368303 0.012955 -0.0644782 0.4020601 -0.2594312 0.1726135 -0.3579323 0.0642221 -0.3232203 -0.5313969 0.131718 -0.1426842 -0.1588647 -0.052153 -0.1944863 -0.0238665 -0.0637784 -0.1690579 -0.2420748 0.1504706 0.1446273 0.0013587 0.5554846 0.6737939 0.1042244 0.5192173 0.3948798 -0.1934724 -0.0425357 -0.0619061 0.3285352 -0.0897939 -0.0282399 0.296722 0.1494546 -0.1781283 0.473637 0.0844227 0.1345241 -0.1512996 0.7896136 -0.5925784 0.3580412 -0.5399121 0.4558233 0.1964755 -0.0696321 0.1834997 0.0431771 0.1303933 -0.1341162 0.1186498 -0.2034927 0.0722877 0.0278135 -0.0316268 -0.1059645 0.0366941 -0.0692615 -0.0470651 -0.0439236 0.0290592 -0.043346 0.152619 0.155633 -0.017761 0.0487059 0.051607 0.1239032 -0.1639865 0.0689187 0.0102852 -0.2606599 -0.05047 0.0411812 -0.00942 -0.4226866 0.1571885 -0.0347742 0.1489507 -0.2744614 -0.1639899 0.005949 -0.0721333 -0.0196126 -0.1954735 0.0224493 -0.0535928 0.0052851 -0.1377702 0.0507856 -0.0678767 -0.0167281 -0.2307469 0.1024807 0.1122026 -0.0550055 0.0593238 0.2621276 0.146887 -0.0441317 0.0327437 -0.1506435 0.1856054 -0.057744 0.0946865 -0.0382102 0.2594203 0.0924804 -0.0761187 -0.0073604 -0.1126292 0.0750941 0.0388537 0.0262416 0.0273097 0.1261984 0.0960225 0.0335111 -0.0676495 0.0087756 -0.0048284 0.1288428 -0.0502747 0.1368646 0.0447434 0.0427124 -0.10095 0.0129665 -0.1326453 0.0620128 -0.0462972 -0.0283148 -0.0314621 0.1008199 -0.0303631 -0.1092839 0.001898 -0.115863 0.0060707 0.050269 -0.0024693 0.049365 0.1179764 0.0177526 -0.0857326 0.0054678 -0.1005948 0.0571388 -0.0309827 -0.0002838 -0.0353781 0.1297746 0.1019835 -0.0233312 0.0120791 -0.0077335 0.0032531 -0.1277693 0.0364456 -0.1261261 0.0220561 -0.0016608 -0.0011679 -0.0813196 0.0067195 0.118187 0.0487832 -0.0916197 0.0427326 0.109582 -0.0243391 -0.0091014 0.1150216 -0.0133029 0.1066313 -0.056106 0.1240733 -0.0553886 0.0413999 unknown
polarizability: 204.8894454|19.7388549|148.1718043|0.8091287|-1.3526945|132.750903 unknown
InChI: InChI=1S/C12H10Cl2N2/c13-9-4-3-5-10(8-9)15-16-12-7-2-1-6-11(12)14/h1-8,15-16H
charge 0 multiplicity 1
26 atoms
Cl 2.891171 2.134129 1.781178
Cl -3.140684 2.080388 -1.954854
N  -0.360449 -0.810609 1.420776
N  0.702238 0.075809 1.370731
C  -1.557777 -0.614371 0.703657
C  1.77413 -0.085755 0.47551
C  -1.720925 0.501475 -0.16077
C  -2.618123 -1.552529 0.856201
C  2.893094 0.788689 0.525795
C  1.793909 -1.11643 -0.504772
C  -2.940395 0.642858 -0.843401
C  -3.822892 -1.370823 0.149865
C  3.988662 0.666166 -0.341152
C  2.889745 -1.250567 -1.381095
C  -4.008174 -0.265627 -0.715469
C  3.991861 -0.367246 -1.307958
H  -0.264374 -1.634847 2.018207
H  0.731068 0.845061 2.044727
H  -0.912193 1.224441 -0.289327
H  -2.496555 -2.413163 1.52498
H  0.936065 -1.792248 -0.569513
H  -4.634926 -2.095745 0.272398
H  4.825621 1.366344 -0.260873
H  2.879168 -2.049441 -2.130359
H  -4.941818 -0.119252 -1.263765
H  4.841354 -0.471908 -1.989417
