program: Gaussian 09
title: 000169160
version: EM64L-G09RevD.01
frameworkgroup: C1[X(C12H14N2O)]
method: RPBEPBE
basis: SDD
operation: Freq
keyword: #p
keyword: freq=noraman
keyword: PBEPBE/SDD
title: #p freq=noraman PBEPBE/SDD
converged: YES YES NO NO
title: Mulliken charges:
elementType: O N N C C C C C C C C C C C C H H H H H H H H H H H H H H
charge: -0.302044 -0.481119 -0.299834 0.161553 0.175938 -0.447558 0.014705 -0.485281 -0.448145 0.256842 0.168352 -0.399796 -0.399340 -0.190442 -0.517915 0.210950 0.230217 0.199944 0.227606 0.215546 0.193888 0.297163 0.268533 0.229137 0.238172 0.218808 0.217248 0.219121 0.227752
chargesum: 0.00000
title: Mulliken charges with hydrogens summed into heavy atoms:
elementType: O N N C C C C C C C C C C C C
charge: -0.302044 -0.183956 -0.031301 0.161553 0.175938 -0.006391 0.014705 -0.057731 -0.038711 0.256842 0.168352 -0.170659 -0.161169 0.028366 0.146207
polarizability: 1.95607758e+02 -1.29107234e+00 1.59760473e+02 -3.36372181e+00 -3.15129459e+00 7.93860561e+01
1716.lowfreq: -9.4039 -7.2749 0.0004 0.0009 0.0009 7.0415 47.7150 76.6599 89.9056
frequency: 47.7112 76.6537 89.8977 141.4490 150.1282 176.5940 179.8536 272.3654 276.0548 319.8972 332.6949 349.0626 378.2170 454.6053 480.8042 490.1898 539.6077 542.1460 557.5421 590.6159 631.1388 640.0798 661.4068 723.9967 740.2901 753.7400 788.6219 855.9548 874.2917 902.2267 926.8186 945.2149 964.3333 996.3881 1000.1009 1037.1744 1057.1566 1062.8453 1110.5958 1139.7629 1148.5793 1155.3929 1169.4332 1176.5412 1190.2259 1211.2556 1231.2028 1239.4071 1275.6482 1291.9124 1318.5599 1344.4774 1383.4528 1401.1107 1429.1794 1433.5108 1449.1438 1454.4759 1458.7051 1465.5230 1470.1836 1473.5263 1478.2578 1491.4852 1575.3412 1601.1554 1630.5597 2816.7768 2870.0845 2951.5215 2970.4786 2977.3501 3037.2850 3041.3778 3043.9206 3108.1396 3127.4434 3144.7079 3163.3970 3473.4851 3607.0243
redmass: 3.0302 3.3982 3.2728 1.8671 2.8624 1.6759 2.8763 3.4026 2.8955 3.0405 3.3317 4.3248 5.0525 2.3796 1.1939 5.1218 3.3393 3.5801 3.0936 4.2568 4.2156 4.3867 3.3354 2.2586 1.9830 3.7770 2.8803 3.0957 1.4250 2.2632 6.6289 1.3325 2.8771 2.3188 1.9208 3.6398 2.0430 1.9439 1.2424 3.1948 1.3539 2.3607 1.4715 1.2212 1.2236 1.7033 1.5425 1.3819 1.8941 1.6207 1.9083 2.2160 1.6288 3.1408 2.1508 1.3061 1.8025 1.1135 1.0748 1.1606 1.5598 1.0702 1.7615 3.0762 6.9649 7.0867 7.0107 1.0716 1.0711 1.0315 1.0641 1.0846 1.1037 1.0930 1.0937 1.1004 1.0860 1.0923 1.0982 1.0755 1.0803
irintensity: 4.9243 2.9744 3.1346 1.0529 0.8185 2.0973 7.9366 3.0502 2.8535 2.4395 0.6149 3.3448 4.1000 58.1868 83.4076 5.9924 24.2158 14.2123 31.3354 3.4207 2.6286 2.0009 44.0303 4.2097 47.8727 27.3901 28.7960 4.7338 0.2778 5.2235 16.2997 3.7989 8.1952 1.3719 0.9734 73.3649 18.2834 4.6226 0.0607 27.8213 2.0656 4.1928 10.0690 1.7635 4.5330 41.3354 40.5626 1.0472 3.6357 25.9890 24.3998 35.7981 16.7638 24.5572 6.7787 1.4176 21.0006 20.2398 2.9349 4.7297 11.5805 13.3888 3.7934 17.5423 32.9419 1.4628 15.9714 125.3331 113.2894 67.4810 42.1302 46.9243 47.5518 28.7024 52.3009 34.8807 2.0228 22.4585 21.5975 1.0552 46.1026
temp: 298.150 k
press: 1.00000 atm
elementType: 8 7 7 6 6 6 6 6 6 6 6 6 6 6 6 1 1 1 1 1 1 1 1 1 1 1 1 1 1
symmnumber: 1
zpe: 625284.9 jmol-1
zpe.correction: 0.238158 hartree
zpe.thermalcorrener: 0.251284 hartree
zpe.thermalcorrenthalpy: 0.252228 hartree
zpe.thermalcorrgfe: 0.198634 hartree
zpe.sumelectzpe: -649.288813 hartree
zpe.sumelectthermal: -649.275688 hartree
zpe.sumelectthermalent: -649.274744 hartree
zpe.sumelectthermalfe: -649.328338 hartree
dipole: -2.5664 -1.8796 0.9496
dipole: 3.3198
quadrupole: -77.0919 -73.6288 -94.0903
quadrupole: 2.7034 5.4543 1.8885
quadrupole: 4.5117 7.9748 -12.4866 2.7034 5.4543 1.8885
hfenergy: -649.5269716 hartree
pointgroup: C01 [X(C12H14N2O1)]
dipole: -0.998775 -0.7639927 0.3530475 debye
polarizability: 195.6948337|-0.5425128|159.8025511|-2.2435126|-2.0172649|79.256902 unknown
InChI: InChI=1S/C12H14N2O/c1-15-11-4-2-3-9-12(11)8-5-6-13-7-10(8)14-9/h2-4,13-14H,5-7H2,1H3
charge 0 multiplicity 1
29 atoms
O  1.666516 2.147238 -0.375801
N  -0.571536 -2.013931 0.160684
N  -3.631454 0.174707 0.311742
C  -0.851247 0.246899 -0.041071
C  -1.510908 -0.971084 0.1017
C  -1.613714 1.544536 -0.169222
C  0.569801 -0.044043 -0.064091
C  -3.003658 -1.157719 0.145952
C  -3.075276 1.231179 -0.572018
C  0.718725 -1.474576 0.056832
C  1.750323 0.736591 -0.203616
C  1.975705 -2.117541 0.047712
C  3.0100 0.109529 -0.222783
C  3.119643 -1.305427 -0.0988
C  1.59129 2.898614 0.889172
H  -1.617568 2.093743 0.793838
H  -1.14229 2.203504 -0.921715
H  -3.334976 -1.690308 -0.784993
H  -3.297997 -1.79578 1.004425
H  -3.702756 2.133736 -0.458999
H  -3.092971 0.936908 -1.651225
H  -0.788836 -3.002548 0.264194
H  -4.655908 0.123572 0.27335
H  2.066728 -3.205258 0.141681
H  3.90388 0.729233 -0.3498
H  4.112397 -1.768313 -0.120986
H  2.493025 2.719031 1.507824
H  0.690571 2.618239 1.470325
H  1.537493 3.961667 0.606288
