program: Gaussian 09
title: 000169148
version: EM64L-G09RevD.01
frameworkgroup: C1[X(C8H18N4O2)]
method: RPBEPBE
basis: SDD
operation: Freq
keyword: #p
keyword: freq=noraman
keyword: PBEPBE/SDD
title: #p freq=noraman PBEPBE/SDD
converged: YES YES NO NO
title: Mulliken charges:
elementType: O O N N N N C C C C C C C C H H H H H H H H H H H H H H H H H H
charge: -0.414910 -0.239666 -0.378410 -0.622207 -0.417245 -0.136835 -0.416125 -0.360908 -0.151346 -0.424800 0.158418 0.274732 -0.639772 -0.719496 0.198613 0.227560 0.267186 0.193015 0.252239 0.196352 0.251894 0.295273 0.269541 0.312121 0.323965 0.379958 0.216307 0.224034 0.245703 0.192828 0.197037 0.244944
chargesum: 0.00000
title: Mulliken charges with hydrogens summed into heavy atoms:
elementType: O O N N N N C C C C C C C C
charge: -0.034953 -0.239666 -0.083137 -0.040545 -0.093280 -0.136835 0.010048 0.099293 0.100893 0.023446 0.158418 0.274732 0.046272 -0.084687
polarizability: 1.26357330e+02 6.01799801e+00 1.28289504e+02 1.48692404e+01 -7.28206414e+00 1.10941388e+02
1716.lowfreq: -20.4652 -2.3648 -0.0008 -0.0006 0.0004 11.9830 20.5480 24.1670 35.5423
frequency: 19.5316 23.8838 34.8585 57.3028 78.3417 97.6612 126.2082 140.4816 157.3648 158.0321 179.0707 210.0724 220.6956 233.1998 253.0253 276.0887 311.1972 345.6813 372.0615 399.8416 410.2767 472.7515 481.7709 524.0029 567.2263 573.4586 600.7224 626.1762 676.0190 712.7202 749.9546 780.1363 797.6444 879.6483 914.7909 957.7352 1017.3310 1047.4423 1050.3442 1066.2424 1074.2845 1077.2945 1113.1432 1118.7151 1129.1449 1161.0632 1172.3568 1190.1493 1209.6705 1223.4282 1263.9583 1279.4313 1286.6236 1319.0722 1328.7193 1351.4994 1372.9746 1386.5550 1402.6391 1434.4546 1439.1630 1444.5848 1458.4708 1469.6993 1471.6550 1475.3742 1485.5312 1501.1571 1510.7049 1603.9574 1641.1702 1669.5533 2872.9623 2928.6059 2931.1668 2954.6934 2972.0299 2978.0419 2983.1298 3020.9389 3027.2203 3056.0481 3056.2166 3074.2441 3081.7044 3492.8517 3519.6856 3562.1142 3606.2436 3635.0965
redmass: 4.4538 4.9226 3.7658 6.7551 4.7007 2.1158 1.8970 1.2429 2.0026 2.5275 2.7318 1.2880 2.4408 2.6490 2.3349 3.1142 2.7741 2.1786 1.1665 2.1822 1.3766 2.8852 1.6964 2.2323 3.6758 2.8520 3.2647 1.6988 8.7908 2.9709 2.3732 2.3852 2.6351 2.1441 2.1732 2.7963 3.0791 1.8781 2.7090 1.7132 1.3798 2.5175 1.7979 1.2867 1.7512 1.6824 1.6480 2.6317 1.9387 1.4163 1.5430 1.3578 1.1745 1.6719 1.3894 1.4248 1.3546 1.8655 1.4024 1.1309 1.1101 1.1515 1.0992 1.0965 1.0568 1.1162 1.0525 1.3202 1.3971 1.2782 4.6377 4.0868 1.0403 1.0476 1.0977 1.0657 1.0812 1.0632 1.0650 1.0867 1.0950 1.0920 1.0982 1.0982 1.0989 1.0451 1.0640 1.0764 1.0767 1.0998
irintensity: 0.8647 0.4679 1.3853 1.6000 2.5253 1.8552 2.8237 7.1103 0.8495 1.7527 8.1821 36.9583 3.5021 14.3295 1.7785 2.3632 4.2064 26.5973 146.1638 114.0626 63.5607 100.2888 231.0913 2.2017 7.3257 45.1942 6.8638 155.4716 13.9180 33.3192 14.4136 6.4085 4.9099 2.8072 2.5865 4.3028 10.9218 7.6379 225.7297 19.1214 5.9352 15.3964 18.7607 7.5946 5.1969 16.9350 16.1174 9.2973 6.3425 6.3430 2.7794 20.9459 1.5244 62.6414 83.9449 4.8412 12.6573 9.7548 50.1175 14.9512 18.4627 6.7285 1.2184 15.1786 11.1635 24.5067 10.2132 181.0991 68.1384 135.7345 343.4445 158.3351 152.4671 92.1524 81.1842 25.2715 46.8817 31.3349 58.5305 43.8592 13.1431 37.3849 50.4792 10.9442 27.5584 11.1006 25.6620 7.4604 20.6388 12.5866
temp: 298.150 k
press: 1.00000 atm
elementType: 8 8 7 7 7 7 6 6 6 6 6 6 6 6 1 1 1 1 1 1 1 1 1 1 1 1 1 1 1 1 1 1
symmnumber: 1
zpe: 708310.0 jmol-1
zpe.correction: 0.269781 hartree
zpe.thermalcorrener: 0.287524 hartree
zpe.thermalcorrenthalpy: 0.288468 hartree
zpe.thermalcorrgfe: 0.222144 hartree
zpe.sumelectzpe: -683.946873 hartree
zpe.sumelectthermal: -683.929130 hartree
zpe.sumelectthermalent: -683.928186 hartree
zpe.sumelectthermalfe: -683.994510 hartree
dipole: 3.6113 -2.2172 2.8541
dipole: 5.1092
quadrupole: -88.8084 -77.8970 -84.2087
quadrupole: 4.4217 8.6639 5.3737
quadrupole: -5.1704 5.7410 -0.5706 4.4217 8.6639 5.3737
hfenergy: -684.2166541 hartree
pointgroup: C01 [X(C8H18N4O2)]
dipole: 1.2305365 0.1326237 -1.5838912 debye
polarizability: 123.9249614|-14.3414842|116.7389907|-9.5152638|-9.1962854|124.9242703 unknown
InChI: InChI=1S/C8H18N4O2/c1-10-8(11-2)12-5-3-4-6(9)7(13)14/h6,10,12-13H,3-5,9H2,1-2H3
charge 0 multiplicity 1
32 atoms
O  -2.324134 -2.017839 -0.551306
O  -3.181607 -1.312315 1.487618
N  1.550353 1.120216 -0.566957
N  -3.862674 1.148926 0.42478
N  3.220968 -0.464185 -1.105241
N  2.251279 -0.372919 1.115865
C  -1.549481 0.8768 -0.648776
C  -0.696605 1.058853 0.62244
C  -2.988394 0.299963 -0.385106
C  0.636844 1.803214 0.362898
C  -2.869375 -1.054337 0.304406
C  2.342493 0.048181 -0.131897
C  3.511645 0.157707 -2.398319
C  3.218115 -1.379233 1.585747
H  -1.686775 1.85421 -1.159055
H  -1.035858 0.203249 -1.36197
H  -0.448373 0.081392 1.075637
H  -1.273777 1.631884 1.376629
H  -3.442383 0.110672 -1.379592
H  0.43596 2.815666 -0.04223
H  1.173383 1.907978 1.321223
H  1.344172 1.185676 -1.563773
H  -3.813765 2.149255 0.230987
H  -3.913764 0.895456 1.41434
H  3.69465 -1.332995 -0.869278
H  -2.217665 -2.872463 -0.052372
H  2.70961 0.000668 -3.152422
H  4.438085 -0.275666 -2.813121
H  3.669823 1.246356 -2.282552
H  4.280774 -1.13244 1.3472
H  3.0179 -2.398252 1.177374
H  3.137876 -1.459477 2.683421
