program: Gaussian 09
title: 000169166
version: EM64L-G09RevD.01
frameworkgroup: C1[X(C20H30O4)]
method: RPBEPBE
basis: SDD
operation: Freq
keyword: #pfreq=noraman
keyword: PBEPBE/SDD
title: #p freq=noraman PBEPBE/SDD
converged: YES YES NO NO
title: Mulliken charges:
elementType: O O O O C C C C C C C C C C C C C C C C C C C C H H H H H H H H H H H H H H H H H H H H H H H H H H H H H H
charge: -0.500151 -0.451180 -0.482191 -0.458806 0.414935 -0.337600 0.248473 -0.353637 -0.253871 -0.626665 0.287752 -0.192354 -0.372487 -0.758158 0.683726 -0.485938 -0.548445 -0.145871 -0.446581 0.581910 -0.800868 -0.751148 -0.824734 -0.823838 0.198496 0.227506 0.264549 0.242673 0.231206 0.221778 0.255455 0.229187 0.243377 0.230404 0.220561 0.253484 0.221238 0.230536 0.217281 0.211383 0.229010 0.223838 0.225133 0.208371 0.243298 0.223059 0.371315 0.345886 0.230002 0.219747 0.352559 0.236916 0.231528 0.357951
chargesum: 0.00000
title: Mulliken charges with hydrogens summed into heavy atoms:
elementType: O O O O C C C C C C C C C C C C C C C C C C C C
charge: -0.128837 -0.105294 -0.129632 -0.100855 0.414935 -0.139104 0.248473 -0.126132 0.010678 -0.152786 0.287752 0.029423 -0.117032 -0.285594 0.683726 -0.034973 -0.073722 0.084665 -0.017917 0.581910 -0.122888 -0.076420 -0.374985 -0.355394
polarizability: 2.46476526e+02 2.88326159e+00 2.05129960e+02 -1.06325268e+01 -1.24053812e+01 1.98242359e+02
1716.lowfreq: -0.0007 -0.0006 -0.0005 5.3763 7.7148 11.6394 33.8451 58.0515 86.0864
frequency: 33.7541 58.0393 86.0797 95.1275 115.6432 122.5644 136.6821 155.4062 171.0826 187.5209 200.1308 220.9998 241.0575 244.7731 264.1781 276.8304 278.4006 286.2292 302.7474 313.0381 326.2657 333.6324 340.9915 346.4352 350.1148 356.0001 382.0846 385.8935 410.3914 421.8605 433.9023 438.2451 469.3825 493.5108 523.3235 536.2776 544.8644 572.2845 592.9910 611.4000 616.5091 656.9961 668.6812 678.0358 689.6734 701.2883 726.9342 738.8654 780.6035 803.1371 821.5861 832.1442 848.9122 854.8427 880.2502 896.2833 906.6331 914.1513 928.0279 936.8269 939.3852 942.7138 945.4486 951.2005 965.1335 972.7132 983.6273 987.7698 1006.4653 1013.8668 1018.6688 1035.3369 1040.1495 1048.0542 1055.9774 1066.9235 1080.9815 1090.6324 1104.2717 1124.4608 1153.2220 1166.2773 1168.4166 1171.0163 1175.1637 1190.8445 1197.5598 1203.6417 1216.6852 1231.3801 1236.6350 1247.4689 1253.6383 1257.4677 1272.9646 1277.5240 1282.6524 1285.8536 1294.6478 1298.8265 1301.6939 1308.0845 1323.2277 1327.7035 1332.5745 1338.1701 1353.0467 1359.3549 1370.1785 1379.7755 1391.9299 1397.7456 1418.5418 1428.5090 1430.3828 1449.1272 1459.5228 1460.1057 1461.9027 1467.1638 1476.7193 1482.6260 1486.0302 1491.1355 1655.4885 1678.1626 2945.6192 2947.5534 2974.2172 2977.1563 2985.7248 2990.3795 2990.7429 2999.2760 3003.7388 3017.7228 3027.0846 3030.1206 3043.4721 3047.0959 3051.2639 3055.6160 3058.0105 3066.6266 3069.1611 3080.4020 3084.2853 3090.4497 3094.7729 3108.6554 3184.8456 3194.1734 3367.4462 3455.3106 3526.4237 3565.7295
redmass: 3.9852 4.1468 3.5006 3.5364 3.4002 3.3295 1.4094 3.8073 3.7453 3.3719 3.4457 1.9792 2.0580 2.1642 2.5404 3.1304 2.5374 3.0337 2.6187 2.6762 2.2274 2.5588 2.4108 1.8267 2.2889 1.7490 2.7684 3.3512 3.6362 2.8952 3.2293 4.2600 2.7701 3.0630 1.8901 1.6092 2.3089 3.2504 3.0435 3.8073 2.5256 2.0514 2.1690 1.7716 1.6476 1.2756 2.7215 2.1169 2.8476 2.7335 3.3037 2.1619 2.4016 3.1336 2.4301 2.5263 2.2683 2.3370 1.9951 1.7762 1.8576 1.5761 1.3851 2.1858 2.1309 3.0030 1.7325 1.9825 2.1689 2.8038 2.3375 2.6844 2.1407 2.5906 2.6403 2.1798 2.3459 2.2708 1.9519 1.9886 1.3572 1.3654 1.6563 1.4473 1.5122 1.6354 1.8249 1.8469 2.2449 1.7596 1.5405 1.7552 1.8255 1.6143 1.5244 1.5747 1.2565 1.6111 1.3821 1.3984 1.3999 1.4425 1.4554 1.4271 1.3983 1.3846 1.4701 1.4565 1.2028 1.2209 1.4920 1.2401 1.1749 1.1730 1.1805 1.0841 1.0948 1.0527 1.0862 1.0529 1.0865 1.0832 1.0563 1.0551 4.7400 6.1899 1.0678 1.0779 1.0355 1.0620 1.0662 1.0382 1.0639 1.0818 1.0743 1.0763 1.0953 1.0875 1.0967 1.0875 1.0956 1.0953 1.0947 1.0982 1.0989 1.0958 1.0625 1.0659 1.0950 1.1002 1.1140 1.1116 1.0655 1.0641 1.0658 1.0661
irintensity: 0.6746 0.7630 1.3245 0.5114 0.2008 3.0398 1.2673 1.0635 1.9495 1.9168 1.1135 1.3892 3.3478 0.8894 0.5221 6.2642 17.0512 1.6741 23.6197 20.3333 23.8490 23.7740 8.6953 36.8545 18.0570 65.0193 4.7018 3.6219 0.7911 4.3033 2.8196 1.2900 2.8753 12.2224 37.7565 54.1249 5.7223 12.3161 1.2367 3.6970 0.6620 79.1614 49.2217 42.9340 2.1537 0.6883 1.9911 21.3638 2.9840 8.3523 9.3651 22.3734 17.9999 9.5642 4.9220 14.8361 17.5621 23.0372 11.3997 5.8195 51.7180 0.7468 2.6377 149.7390 15.3656 18.1208 6.7880 9.6093 7.9049 44.0920 12.6533 73.0264 9.3733 28.9873 26.9336 3.5137 14.8558 4.7055 7.5530 6.9730 36.5704 3.4133 5.4815 23.3313 3.5029 31.4212 1.9469 16.6715 2.4806 9.8678 8.4610 13.8985 0.8167 6.4840 2.1814 13.6043 23.4379 8.6437 3.6272 1.7726 0.3681 3.5725 29.0386 32.6317 1.3958 5.5776 7.8920 14.3535 21.6868 16.1778 5.9458 26.3185 67.7288 8.1700 20.1867 10.6899 9.0650 4.8749 11.0715 5.3634 8.2667 9.7101 14.8179 19.0638 21.6963 26.5997 16.7565 22.0334 20.7359 39.4958 22.4904 32.8112 20.0802 17.4231 16.7766 20.6554 23.7084 31.8665 34.1381 51.2037 14.5331 2.5909 73.5017 36.7690 40.2711 35.2068 8.8400 5.2362 15.2084 15.0658 13.7715 18.1699 84.3977 38.6681 8.1017 6.2787
temp: 298.150 k
press: 1.00000 atm
elementType: 8 8 8 8 6 6 6 6 6 6 6 6 6 6 6 6 6 6 6 6 6 6 6 6 1 1 1 1 1 1 1 1 1 1 1 1 1 1 1 1 1 1 1 1 1 1 1 1 1 1 1 1 1 1
symmnumber: 1
zpe: 1217548.2 jmol-1
zpe.correction: 0.463740 hartree
zpe.thermalcorrener: 0.486832 hartree
zpe.thermalcorrenthalpy: 0.487776 hartree
zpe.thermalcorrgfe: 0.415054 hartree
zpe.sumelectzpe: -1079.095805 hartree
zpe.sumelectthermal: -1079.072713 hartree
zpe.sumelectthermalent: -1079.071769 hartree
zpe.sumelectthermalfe: -1079.144491 hartree
dipole: -4.6560 -1.6831 1.8425
dipole: 5.2826
quadrupole: -162.1209 -145.9829 -142.2251
quadrupole: -10.6749 -0.5353 -2.3528
quadrupole: -12.0113 4.1267 7.8845 -10.6749 -0.5353 -2.3528
hfenergy: -1079.5595448 hartree
pointgroup: C01 [X(C20H30O4)]
dipole: -1.8237982 0.6475365 -0.7575908 debye
polarizability: 246.2017144|-2.4642707|204.7872594|11.3299264|-12.4958395|198.8598719 unknown
InChI: InChI=1S/C20H30O4/c1-10-8-19-9-16(22)20(24)14(7-15(21)18(20,3)4)11(2)13(19)6-5-12(10)17(19)23/h12-17,21-24H,1-2,5-9H2,3-4H3
charge 0 multiplicity 1
54 atoms
O  2.307886 0.037455 1.597601
O  -3.315837 2.005922 1.186855
O  1.572871 2.576364 1.191856
O  4.376114 -1.286681 0.325959
C  -1.536245 0.348718 0.441478
C  -1.246004 -1.185991 0.670023
C  1.820343 0.383153 0.238523
C  1.147768 -0.895373 -0.389921
C  -2.975599 0.579233 1.04489
C  -0.485597 1.232296 1.157344
C  3.081112 0.630251 -0.693948
C  0.823161 1.557933 0.400114
C  -3.874706 -0.109166 -0.01346
C  -1.801613 0.750327 -1.056665
C  0.221893 -1.634949 0.570215
C  -2.196763 -2.054865 -0.203317
C  2.326139 -1.7029 -1.026708
C  3.607323 -0.842018 -0.84449
C  -3.675306 -1.655246 0.031863
C  -3.292599 0.468436 -1.305978
C  2.667088 1.174307 -2.087994
C  4.151806 1.571321 -0.097773
C  0.645811 -2.659307 1.354482
C  -3.974406 0.710462 -2.451342
H  -1.542316 -1.37646 1.724602
H  0.526883 -0.508147 -1.218086
H  -3.076162 0.167363 2.063192
H  -0.21237 0.768666 2.12562
H  -0.987028 2.199093 1.380365
H  0.590828 1.982501 -0.595414
H  -4.942348 0.139623 0.127064
H  -1.170843 0.205606 -1.779475
H  -1.588131 1.82755 -1.202028
H  -2.047001 -3.12083 0.046823
H  -1.938036 -1.947517 -1.274615
H  2.48302 -2.683467 -0.55226
H  2.121407 -1.888861 -2.09707
H  4.309295 -0.939241 -1.690793
H  -4.32475 -2.12722 -0.728716
H  -4.007253 -2.022979 1.023955
H  1.881683 0.569722 -2.576996
H  2.306518 2.216754 -2.015517
H  3.547015 1.178812 -2.757684
H  5.003266 1.648996 -0.799585
H  3.737924 2.578039 0.076439
H  4.556765 1.182581 0.850727
H  2.466157 0.917813 2.039674
H  -3.644547 2.340694 0.311835
H  1.672175 -3.037421 1.32963
H  -0.030596 -3.141091 2.072072
H  0.923341 3.200522 1.603292
H  -5.046796 0.498304 -2.5352
H  -3.483214 1.118694 -3.343004
H  3.825876 -1.030283 1.123146
