program: Gaussian 09
title: 000169078
version: EM64L-G09RevD.01
frameworkgroup: C1[X(C6H6N4O3)]
method: RPBEPBE
basis: SDD
operation: Freq
keyword: #pfreq=noraman
keyword: PBEPBE/SDD
title: #p freq=noraman PBEPBE/SDD
converged: NO NO NO NO
title: Mulliken charges:
elementType: O O O N N N N C C C C C C H H H H H H
charge: -0.235169 -0.274921 -0.246883 -0.405111 -0.391207 -0.425735 -0.383900 0.353157 0.159140 -0.459225 0.118300 0.128458 0.151997 0.261504 0.261303 0.313773 0.364869 0.342507 0.367143
chargesum: 0.00000
title: Mulliken charges with hydrogens summed into heavy atoms:
elementType: O O O N N N N C C C C C C
charge: -0.235169 -0.274921 -0.246883 -0.091337 -0.026338 -0.083228 -0.016757 0.353157 0.159140 0.063582 0.118300 0.128458 0.151997
polarizability: 1.56106939e+02 -3.65759535e-01 1.18061042e+02 5.44603502e-03 -1.19244227e-03 4.51581899e+01
1716.lowfreq: -41.0893 -6.1559 -0.0012 -0.0010 -0.0009 7.2040 13.3330 77.8552 152.6915
frequency: -40.9847 77.8535 152.6915 172.2424 184.5755 213.0594 329.1690 335.6899 366.7051 393.6368 423.2033 494.4869 523.1735 526.5298 554.7319 575.5119 596.5170 630.0344 663.4435 678.6532 707.2533 747.3322 764.4214 845.1765 865.6502 955.8185 999.4744 1057.6742 1109.3337 1224.9843 1237.8787 1249.8153 1287.9437 1328.1934 1334.4798 1346.5570 1376.6952 1431.7115 1461.2381 1477.6812 1563.9226 1622.6466 1639.6119 1674.5934 1686.5421 2980.0872 3025.6937 3491.6194 3539.4134 3556.9753 3559.2730
redmass: 2.2608 10.9361 7.3112 10.0353 3.8491 10.3255 2.5755 12.6479 1.9597 10.5738 8.1222 6.6648 7.3467 2.6291 1.2058 7.4937 4.8076 9.5168 5.7414 1.8912 7.7003 2.4437 1.3488 5.1158 4.6178 3.8534 1.7959 3.2175 4.8042 1.0670 4.8316 2.9604 2.2690 1.5070 2.1032 2.7078 2.2047 1.8457 2.8710 1.2117 3.1194 7.4163 6.8564 4.6764 8.2341 1.0580 1.1046 1.0765 1.0773 1.0781 1.0774
irintensity: 0.3639 4.2214 0.0002 0.7558 2.5036 7.2004 42.6640 14.4601 25.4516 10.7161 0.1072 18.4613 7.7070 2.7290 158.1809 10.4038 2.1499 15.3211 12.1541 16.9908 13.7653 55.2497 226.5020 4.2696 0.4856 20.9926 0.0855 14.6564 27.8111 0.7966 0.6345 110.8801 14.0212 80.9944 19.3492 111.5934 134.7165 1.1439 3.4983 20.5245 135.2624 273.0639 737.4347 705.6973 333.6287 46.7878 13.3635 70.5544 83.2383 54.8642 53.9216
temp: 298.150 k
press: 1.00000 atm
elementType: 8 8 8 7 7 7 7 6 6 6 6 6 6 1 1 1 1 1 1
symmnumber: 1
zpe: 353147.2 jmol-1
zpe.correction: 0.134507 hartree
zpe.thermalcorrener: 0.144433 hartree
zpe.thermalcorrenthalpy: 0.145377 hartree
zpe.thermalcorrgfe: 0.099026 hartree
zpe.sumelectzpe: -676.033414 hartree
zpe.sumelectthermal: -676.023487 hartree
zpe.sumelectthermalent: -676.022543 hartree
zpe.sumelectthermalfe: -676.068895 hartree
dipole: 0.2835 -6.1182 0.0085
dipole: 6.1248
quadrupole: -101.4941 -68.7093 -74.5385
quadrupole: -10.7261 0.0311 -0.0048
quadrupole: -19.9135 12.8713 7.0421 -10.7261 0.0311 -0.0048
hfenergy: -676.1679204 hartree
pointgroup: C01 [X(C6H6N4O3)]
dipole: 0.1040777 -2.4074299 0.0038162 debye
dipolederiv: -1.4921164 -0.1316432 0.0005024 -0.3212301 -0.5100902 0.0007445 0.0020606 0.0007732 -0.3721082 -0.5339595 -0.053483 -0.000069 0.1396547 -1.4096671 -0.0003116 -0.0002724 0.0004863 -0.373521 -1.5296063 -0.3136714 -0.0002855 -0.3851457 -0.5895493 -0.00015 -0.0004583 -0.0002831 -0.3892435 -0.76376 0.6105173 -0.0008832 0.289709 -0.8122454 0.0002742 0.0029865 -0.0036307 -0.4499244 -1.2098475 -0.1678041 0.000403 0.6953545 -0.3079535 0.0005349 -0.0014192 0.0005067 -0.2888222 -1.3704888 -0.2190173 -0.0003235 0.3215585 -0.4714162 -0.0002053 0.00011 0.0002623 -0.3084261 -0.9221776 -0.2710324 -0.0001879 -0.6000979 -0.8084436 -0.0003057 -0.0007065 -0.0001528 -0.3409133 1.0344788 -0.1720481 -0.0008531 -0.4304078 1.517626 0.000897 -0.0010393 0.0019174 0.1684009 0.2594104 0.6257764 -0.0011677 0.5849121 -1.023965 -0.0001855 -0.0011831 -0.0019461 -0.0729552 0.5513752 -0.2044855 0.0046558 0.0448339 -0.2287196 0.0012625 0.0021254 0.0030554 0.3356127 2.0262638 0.1151903 -0.0015138 -0.2886267 0.7095867 -0.002591 -0.0006035 -0.0027722 0.1996899 1.2761702 -0.2123528 0.0003528 -0.1400464 1.8329654 0.0002704 0.0011258 -0.000152 0.2341415 2.1357471 0.3052685 0.0003574 0.1818049 1.0929301 0.0005603 0.0003493 0.0008066 0.3185475 -0.0625975 0.0554965 0.0476028 0.0210681 0.0834683 -0.0515006 0.102755 -0.09455 -0.025446 -0.0631563 0.0553774 -0.0478429 0.019808 0.0841706 0.0508967 -0.105569 0.0950334 -0.0298947 0.0955859 -0.0578331 -0.0006942 -0.078456 0.1820585 -0.0003935 -0.0008056 0.0000268 0.3687458 0.1998053 0.0660281 -0.0000567 -0.05461 0.2391904 0.0002709 0.0005996 0.0004629 0.3388151 0.1600806 0.0335141 0.0000546 0.0568652 0.2199309 0.0000046 0.0000157 0.0002669 0.341732 0.2087926 -0.0637978 -0.0000512 -0.0569484 0.200123 -0.0000728 -0.000071 -0.000111 0.3455691 unknown
polarizability: 156.1043025|-0.483637|118.0636714|0.0220747|-0.0148542|45.158197 unknown
InChI: InChI=1S/C6H6N4O3/c11-2-1-7-4-3(8-2)5(12)10-6(13)9-4/h7-10H,1H2
charge 0 multiplicity 1
19 atoms
O  3.819849 0.532807 -0.002256
O  -0.715973 2.689118 0.00059
O  -3.701282 -0.954407 -0.000701
N  0.95337 -1.827282 -0.002178
N  1.519611 0.920769 -0.001301
N  -1.397361 -1.360595 -0.000732
N  -2.194438 0.855055 0.000477
C  -0.073679 -0.909349 -0.000526
C  0.180798 0.45594 0.000484
C  2.377525 -1.420903 0.006604
C  2.630157 0.106016 0.000137
C  -0.886369 1.428445 0.001038
C  -2.523727 -0.505491 -0.000257
H  2.905075 -1.827092 -0.878469
H  2.892594 -1.817752 0.903501
H  0.749174 -2.826976 -0.004684
H  1.646113 1.940162 -0.003396
H  -1.62432 -2.35699 -0.000816
H  -2.984316 1.507025 0.000588
