program: Gaussian 09
title: 000169196
version: EM64L-G09RevD.01
frameworkgroup: C1[X(C19H30NO6)]
method: RPBEPBE
basis: SDD
operation: Freq
keyword: #p
keyword: freq=noraman
keyword: PBEPBE/SDD
title: #p freq=noraman PBEPBE/SDD
converged: YES YES NO NO
title: Mulliken charges:
elementType: O O O O O O N C C C C C C C C C C C C C C C C C C C H H H H H H H H H H H H H H H H H H H H H H H H H H H H H H
charge: -0.363234 -0.265421 -0.313178 -0.207698 -0.443863 -0.183900 -0.146994 0.045606 -0.062629 -0.405388 -0.506763 -0.393819 0.436809 -0.621962 -0.332008 -0.404866 -0.239461 0.206489 -0.087839 0.132234 -0.075560 0.213201 -0.761251 -0.724514 -0.721251 -0.717565 0.307954 0.287425 0.279987 0.289144 0.263856 0.277409 0.285719 0.272921 0.300114 0.267479 0.295792 0.383731 0.258441 0.252704 0.273043 0.251348 0.245726 0.228783 0.233720 0.262115 0.237749 0.245781 0.236153 0.216361 0.235018 0.214080 0.221430 0.229331 0.230293 0.361222
chargesum: 1.00000
title: Mulliken charges with hydrogens summed into heavy atoms:
elementType: O O O O O O N C C C C C C C C C C C C C C C C C C C
charge: 0.020496 -0.265421 -0.313178 -0.207698 -0.082640 -0.183900 -0.146994 0.045606 0.245324 0.162024 0.046237 0.169308 0.436809 0.218552 -0.036215 0.106279 0.033582 0.206489 0.163509 0.132234 0.170165 0.213201 -0.036633 -0.004831 -0.055793 -0.036512
polarizability: 2.79016953e+02 8.50362379e-01 2.12817471e+02 -1.23808021e+01 -4.88576599e+00 1.85171016e+02
1716.lowfreq: -10.8593 -4.5539 -0.0011 -0.0010 -0.0007 8.9681 20.4625 40.9273 50.2241
frequency: 20.1391 40.8498 50.1193 62.8363 71.2913 97.3451 109.1481 119.0097 132.7510 160.6911 166.2542 177.1049 186.5968 189.3295 199.4892 201.7345 209.5906 225.1284 235.9280 247.2699 251.2866 259.1412 273.9082 277.1892 296.8876 311.1986 313.4842 319.9871 332.4204 335.1736 364.0262 370.6585 379.3288 396.5439 411.2019 420.7526 424.3876 455.0345 467.6064 479.8009 493.0161 514.2419 539.5515 550.6740 564.4764 597.4545 623.3906 648.8222 667.9840 681.8919 711.0518 735.5255 747.6098 789.4073 804.3369 820.9904 839.5188 856.8116 860.3450 884.2678 896.4653 902.5726 911.6559 922.0874 926.6014 936.2036 948.8217 954.3772 958.4999 965.5170 1002.0070 1006.2578 1011.7662 1027.7906 1030.6428 1041.0512 1042.7684 1057.8100 1073.0863 1083.8129 1104.5422 1109.6266 1111.7469 1120.4682 1130.2437 1144.6164 1155.0789 1156.2264 1163.9081 1172.0892 1199.7297 1213.0985 1228.0458 1243.0932 1245.2624 1258.6699 1271.6061 1273.3737 1285.8192 1291.1109 1311.8822 1317.0609 1325.4005 1333.7855 1337.6558 1342.5745 1356.8991 1359.8889 1362.1750 1379.2355 1385.8492 1389.2677 1403.5950 1408.7575 1429.1899 1460.4111 1462.5056 1463.4874 1465.6433 1467.6479 1471.7943 1473.9512 1477.0077 1482.3390 1483.2127 1486.3718 1491.5484 1492.2210 1495.0364 1646.6689 1665.8033 1676.4569 2972.9835 2983.3906 2999.0163 3006.5522 3010.0993 3013.7756 3015.3733 3020.7025 3021.7823 3029.0476 3031.2578 3037.0006 3039.4829 3063.7171 3075.9797 3076.2791 3082.1900 3083.6399 3086.4810 3091.8281 3105.4682 3110.2722 3113.2136 3116.7234 3128.9011 3133.5377 3152.0729 3185.4728 3541.0971 3544.2018
redmass: 3.8823 3.9494 4.2246 4.3514 3.9161 3.6005 3.4173 4.8408 6.2235 3.6537 2.3544 2.0799 1.2735 3.5313 2.1219 2.2453 1.9839 2.5066 2.0846 1.3724 2.7151 2.6896 2.6548 4.3296 1.9344 3.0934 2.6724 2.3967 3.2125 2.3486 1.6995 2.4512 2.6858 1.6492 2.1700 2.3789 1.9873 3.1267 3.9793 3.1959 3.2491 3.7642 4.5275 4.8957 4.0800 3.5766 3.8821 4.0475 4.2819 7.3041 6.2132 4.7419 5.0319 2.5021 2.5331 3.3233 2.2893 3.4470 2.5679 3.0968 2.4502 2.1683 2.0269 1.2369 4.3898 2.1396 2.1889 2.4036 1.4598 1.9596 2.1569 5.0437 2.2200 2.4083 2.5205 1.8308 2.0746 1.9958 1.9907 3.0180 1.7368 1.8996 3.8075 2.4447 2.2538 1.8229 2.2618 1.5323 2.4633 2.2644 1.3413 1.6873 1.5989 1.4401 1.5185 1.3560 1.2805 1.2910 1.3957 1.4767 1.2768 1.4655 1.2841 1.5753 1.5631 1.5535 1.3077 1.4042 1.4984 1.5374 1.2176 1.2119 1.1992 1.1882 1.1516 1.0516 1.0545 1.0626 1.0852 1.0724 1.0507 1.0486 1.0504 1.0544 1.0758 1.0639 1.0642 1.0444 1.0472 9.6814 11.0793 7.9615 1.0363 1.0375 1.0802 1.0396 1.0589 1.0820 1.0369 1.0470 1.0458 1.0830 1.0842 1.0670 1.0600 1.0989 1.0996 1.1060 1.1058 1.0988 1.0988 1.0979 1.1029 1.1002 1.1003 1.1073 1.1046 1.0995 1.1041 1.0979 1.0653 1.0668
irintensity: 0.9010 0.9149 0.1731 2.7470 2.4428 2.1227 0.2599 0.2698 0.3598 1.9453 2.7859 1.3776 0.2818 0.6178 0.9545 1.5782 2.5137 0.5536 3.1829 1.5558 5.5727 1.0385 4.2876 26.5999 8.8210 7.0009 6.3898 13.5854 4.3116 19.8609 82.3643 14.1333 12.5157 55.2259 13.9228 2.3828 24.9257 2.9642 0.0840 25.1357 13.2757 11.6468 3.1912 2.3236 16.4885 15.7694 3.5794 0.7026 3.7773 7.7456 12.3314 3.6072 40.0712 18.5299 8.6636 3.5633 22.3987 2.8236 72.9069 9.8401 6.7933 28.5722 13.2751 8.1877 8.2444 2.6524 16.6942 57.2795 7.4268 3.6969 16.1029 111.1228 24.0307 23.8720 352.4110 16.2544 8.7715 170.2771 49.9724 32.1347 2.9335 34.4194 46.2269 81.6879 23.6598 0.6977 14.3296 3.7613 4.4554 16.2458 0.8311 2.8401 2.3582 10.9425 4.5107 3.9764 34.8069 16.2728 13.8367 14.6365 15.2855 7.9708 6.1108 7.5932 13.0762 41.6097 1.0446 9.8477 8.5611 24.5434 26.5649 14.9033 20.3259 31.8549 16.4835 8.0799 6.0445 22.7330 13.8845 1.7521 17.6863 11.2963 2.9913 14.7643 22.9638 53.2524 1.3175 8.9303 24.5771 58.7185 181.0442 19.2211 31.5954 14.5984 1.5153 16.9917 13.0960 4.5285 11.1320 2.7853 6.5216 3.8272 5.3866 2.9006 9.7446 46.2344 3.2105 5.0882 4.6789 48.3061 37.1731 25.4569 2.6575 12.8424 14.7589 3.3986 2.7404 8.0237 0.7513 2.3800 15.7270 37.6660
temp: 298.150 k
press: 1.00000 atm
elementType: 8 8 8 8 8 8 7 6 6 6 6 6 6 6 6 6 6 6 6 6 6 6 6 6 6 6 1 1 1 1 1 1 1 1 1 1 1 1 1 1 1 1 1 1 1 1 1 1 1 1 1 1 1 1 1 1
symmnumber: 1
zpe: 1235317.8 jmol-1
zpe.correction: 0.470508 hartree
zpe.thermalcorrener: 0.497593 hartree
zpe.thermalcorrenthalpy: 0.498537 hartree
zpe.thermalcorrgfe: 0.415766 hartree
zpe.sumelectzpe: -1245.819880 hartree
zpe.sumelectthermal: -1245.792795 hartree
zpe.sumelectthermalent: -1245.791851 hartree
zpe.sumelectthermalfe: -1245.874622 hartree
dipole: 15.2748 1.4036 -2.0338
dipole: 15.4734
quadrupole: -64.6186 -134.6275 -154.2067
quadrupole: -8.9473 -6.3947 -1.3330
quadrupole: 53.1990 -16.8099 -36.3891 -8.9473 -6.3947 -1.3330
hfenergy: -1246.2903879 hartree
pointgroup: C01 [X(C19H30N1O6)]
dipole: -5.9800265 0.8682711 0.7386551 debye
polarizability: 279.134209|-4.2680744|212.2090604|-10.3974853|7.5536603|185.6621705 unknown
InChI: InChI=1S/C19H30NO6/c1-11(2)15-12(3)18(4,23)17(22)25-10-13-6-8-20(5)9-7-14(19(13,20)24)26-16(15)21/h6,11-12,14-15,23-24H,7-10H2,1-5H3
charge 1 multiplicity 1
56 atoms
O  -2.541713 0.29741 -2.018067
O  -0.246504 1.080484 0.486139
O  0.269074 -1.774955 0.18229
O  0.636784 0.739074 -1.641954
O  2.18827 -1.478827 1.941362
O  1.621794 -2.823592 -1.403934
N  -3.861312 0.423406 0.1203
C  -2.386357 0.16742 -0.616257
C  -1.538348 1.406553 -0.127534
C  -3.82259 1.887304 0.570688
C  -2.360562 2.136008 0.951279
C  -3.890564 -0.58155 1.287268
C  -2.046736 -1.227817 -0.108105
C  -5.016295 0.16056 -0.823338
C  -2.863256 -1.617856 0.902744
C  -0.911977 -2.036144 -0.681149
C  2.179441 0.941773 0.309974
C  0.851111 0.872768 -0.41982
C  3.157507 -0.24504 -0.008218
C  2.653263 -1.643275 0.553341
C  2.819135 2.354716 -0.016398
C  1.525256 -2.182307 -0.345009
C  3.625458 -0.303009 -1.48003
C  3.795997 -2.670499 0.620043
C  1.860242 3.509781 0.363641
C  4.171733 2.536042 0.711385
H  -1.370905 2.016601 -1.035089
H  -4.54376 2.040971 1.389277
H  -4.126207 2.497007 -0.297193
H  -2.12783 3.211662 0.979909
H  -2.113084 1.718485 1.942963
H  -4.911771 -0.98291 1.402814
H  -3.617359 -0.058499 2.221089
H  -5.952657 0.445536 -0.317407
H  -4.882139 0.759676 -1.734753
H  -5.046142 -0.910601 -1.078763
H  -2.790118 -2.57124 1.432344
H  -2.694231 -0.571865 -2.47131
H  -1.132981 -3.117276 -0.658043
H  -0.654024 -1.746361 -1.717138
H  1.970879 0.928943 1.395599
H  4.039864 -0.048154 0.630751
H  2.9911 2.399255 -1.109615
H  4.161866 0.622704 -1.751201
H  4.326213 -1.139065 -1.639197
H  2.785527 -0.419797 -2.183704
H  4.6240 -2.25292 1.216831
H  3.441683 -3.585983 1.121416
H  4.162663 -2.939487 -0.382154
H  1.606132 3.479684 1.440014
H  2.343157 4.481151 0.156779
H  0.918081 3.48491 -0.215364
H  4.064483 2.381776 1.801736
H  4.543821 3.564098 0.552728
H  4.951295 1.848375 0.341088
H  1.242492 -1.177906 1.930851
