program: Gaussian 09
title: 000169018
version: EM64L-G09RevD.01
frameworkgroup: C1[X(C7H20N3O2P)]
method: RPBEPBE
basis: SDD
operation: Freq
keyword: #p
keyword: freq=noraman
keyword: PBEPBE/SDD
title: #p freq=noraman PBEPBE/SDD
converged: YES YES NO NO
title: Mulliken charges:
elementType: P O O N N N C C C C C C C H H H H H H H H H H H H H H H H H H H H
charge: 1.393821 -0.639357 -0.280469 -0.474349 -0.466068 -0.739770 -0.360962 -0.582011 -0.578161 -0.587158 -0.583803 -0.223941 -0.496756 0.326835 0.224648 0.244995 0.221996 0.262352 0.218810 0.239977 0.226291 0.221803 0.223177 0.223822 0.238048 0.214381 0.278884 0.210025 0.237807 0.170581 0.196452 0.229913 0.208185
chargesum: 0.00000
title: Mulliken charges with hydrogens summed into heavy atoms:
elementType: P O O N N N C C C C C C C
charge: 1.393821 -0.639357 -0.280469 -0.474349 -0.466068 -0.412935 0.108681 0.121148 0.109911 0.097889 0.119487 0.184448 0.137793
polarizability: 1.48301397e+02 1.00550243e+00 1.25690459e+02 2.82539193e+00 -1.67521197e+00 1.07183410e+02
1716.lowfreq: -14.9410 -4.6568 -0.0011 -0.0006 0.0009 13.9727 18.1331 34.3727 55.4204
frequency: 10.7816 32.7864 55.3481 75.5948 86.6658 87.4609 90.4400 128.2473 155.4408 166.8099 182.4847 189.2180 198.6161 206.0711 227.3686 231.1074 253.9483 272.0174 309.4101 317.2085 330.6034 356.2595 402.3837 407.5003 429.1617 434.9005 503.4357 586.4260 667.9873 746.7924 813.4983 896.3980 948.6731 958.3298 1006.1144 1040.9855 1053.7461 1063.7400 1080.0707 1091.8316 1094.3532 1095.4127 1115.1475 1131.2854 1133.7253 1136.3459 1161.6050 1179.8305 1190.4624 1213.8173 1259.5108 1270.5908 1280.5728 1325.2957 1361.1905 1379.8065 1413.8285 1421.5611 1430.3297 1437.9756 1438.7149 1459.1266 1459.5492 1463.7345 1469.8470 1470.7143 1476.5174 1477.6280 1480.2226 1484.3854 1490.6481 1495.5875 1498.4753 2912.6762 2925.2087 2927.6719 2934.4405 2936.8778 2940.7573 2990.7516 2997.1859 3007.7922 3009.5527 3011.8686 3019.7107 3022.4274 3074.6428 3075.4379 3089.5171 3092.9328 3098.1192 3099.9975 3575.4925
redmass: 3.1273 3.4885 2.7415 2.1530 2.3537 2.5993 2.6655 2.1831 3.1811 1.6178 2.1841 1.1117 1.2005 2.2893 1.4677 1.3492 2.5532 3.9421 3.3103 2.1023 3.1827 1.5622 3.4866 3.4936 3.8039 3.7824 3.8032 4.8236 6.5136 4.0117 1.2847 5.2482 3.0033 3.0251 5.8938 4.1279 1.3892 1.3461 6.6698 1.5700 1.2236 1.2248 1.5310 2.1972 1.3843 1.3702 1.4947 2.4060 1.6832 6.2705 2.1402 2.1542 1.1498 1.2571 1.2520 1.3610 1.1232 1.1223 1.1423 1.1476 1.1436 1.0525 1.0688 1.0458 1.0554 1.0475 1.0509 1.0509 1.0493 1.0481 1.0741 1.0557 1.0557 1.0558 1.0386 1.0405 1.0395 1.0406 1.0417 1.1005 1.1025 1.0954 1.0609 1.0953 1.0942 1.0962 1.1059 1.0976 1.0969 1.0968 1.0973 1.0966 1.0771
irintensity: 2.7747 2.0083 2.1525 1.2446 1.5815 0.5564 3.6232 6.2303 3.6939 1.3097 1.1795 1.4743 0.7641 1.3630 5.7636 1.3046 7.3557 53.6037 7.8042 16.8012 26.7736 28.4474 6.9384 7.8752 53.1804 18.7399 2.2447 22.0683 123.4251 136.6404 3.3814 23.5277 203.9575 139.3652 113.9563 31.5321 10.4981 8.3353 144.8971 2.3885 0.1583 0.5031 23.0837 56.0917 6.5602 1.2420 15.8653 35.0251 14.8713 54.5929 9.2447 12.6276 9.5756 0.7563 33.7668 1.4365 10.8023 16.6611 1.9594 1.0789 1.3961 11.1392 13.2737 4.2139 13.3795 3.2305 10.5530 18.4278 27.9666 33.1062 6.0724 2.0284 2.9793 62.0487 97.6406 63.3382 176.8595 61.9080 100.3595 44.5021 52.6883 75.8881 52.2960 9.7160 84.1581 4.4458 19.2622 25.1512 2.9809 15.1839 37.5998 9.5871 13.6430
temp: 298.150 k
press: 1.00000 atm
elementType: 15 8 8 7 7 7 6 6 6 6 6 6 6 1 1 1 1 1 1 1 1 1 1 1 1 1 1 1 1 1 1 1 1
symmnumber: 1
zpe: 735923.0 jmol-1
zpe.correction: 0.280298 hartree
zpe.thermalcorrener: 0.299076 hartree
zpe.thermalcorrenthalpy: 0.300020 hartree
zpe.thermalcorrgfe: 0.231777 hartree
zpe.sumelectzpe: -933.507035 hartree
zpe.sumelectthermal: -933.488258 hartree
zpe.sumelectthermalent: -933.487314 hartree
zpe.sumelectthermalfe: -933.555557 hartree
dipole: -1.9652 1.9678 -2.9286
dipole: 4.0387
quadrupole: -80.4335 -83.4010 -92.2147
quadrupole: 6.0428 3.3005 0.2156
quadrupole: 4.9162 1.9487 -6.8650 6.0428 3.3005 0.2156
hfenergy: -933.7873336 hartree
pointgroup: C01 [X(C7H20N3O2P1)]
dipole: -0.8904752 -0.4285416 1.2442254 debye
polarizability: 146.2535646|-6.6451719|127.0168794|-3.9101191|-2.961546|107.9048214 unknown
InChI: InChI=1S/C7H20N3O2P/c1-9(2)13(11,10(3)4)8-6-7-12-5/h8H,6-7H2,1-5H3
charge 0 multiplicity 1
33 atoms
P  -0.679897 0.245239 -0.130875
O  0.010423 0.17873 -1.579548
O  4.12636 -0.340107 0.260073
N  -1.806214 -0.990419 0.428677
N  -1.659724 1.691751 0.006289
N  0.518717 0.116705 1.122164
C  1.936593 0.443528 0.886383
C  -3.210572 -0.951245 -0.028794
C  -1.294619 -2.364804 0.62456
C  -2.158041 2.133403 1.31685
C  -1.562856 2.721855 -1.041222
C  2.721538 -0.753134 0.320665
C  4.968084 -1.326866 -0.409613
H  0.224518 -0.141064 2.063965
H  2.396746 0.768702 1.837409
H  2.022585 1.282549 0.172906
H  -3.362447 -1.534395 -0.962606
H  -3.512025 0.092211 -0.212306
H  -3.861932 -1.37954 0.757073
H  -0.223821 -2.339149 0.885357
H  -1.418027 -2.985875 -0.288382
H  -1.848136 -2.85002 1.451388
H  -3.147605 2.616373 1.196943
H  -1.475928 2.863768 1.804274
H  -2.285043 1.266686 1.988935
H  -2.574521 3.08032 -1.317221
H  -1.082829 2.282286 -1.931618
H  -0.96086 3.594959 -0.709233
H  2.332142 -1.001271 -0.689698
H  2.605889 -1.642743 0.982151
H  4.969525 -2.298595 0.130828
H  5.989044 -0.912772 -0.416107
H  4.634333 -1.502163 -1.454567
