program: Gaussian 09
title: 000169028
version: EM64L-G09RevD.01
frameworkgroup: C1[X(C15H16O2S)]
method: RPBEPBE
basis: SDD
operation: Freq
keyword: #p
keyword: freq=noraman
keyword: PBEPBE/SDD
title: #p freq=noraman PBEPBE/SDD
converged: YES YES NO NO
title: Mulliken charges:
elementType: S O O C C C C C C C C C C C C C C C H H H H H H H H H H H H H H H H
charge: 0.814577 -0.542348 -0.543516 -0.193577 0.314084 -0.182478 0.350707 0.470294 -0.278193 -0.258526 -0.839914 -0.417847 -0.240712 -0.391654 -0.826769 -0.827825 -0.248244 -0.214509 0.309806 0.305302 0.283696 0.250321 0.240740 0.236659 0.241384 0.241124 0.239861 0.236279 0.232447 0.225318 0.283541 0.252998 0.242668 0.234306
chargesum: 0.00000
title: Mulliken charges with hydrogens summed into heavy atoms:
elementType: S O O C C C C C C C C C C C C C C C
charge: 0.814577 -0.542348 -0.543516 -0.193577 0.314084 -0.182478 0.350707 0.470294 0.031613 0.046776 -0.065157 -0.181189 0.000673 -0.150530 -0.118182 -0.065968 -0.005576 0.019797
polarizability: 2.23052599e+02 1.95889752e+01 1.85250037e+02 7.46414337e+00 1.48430211e+01 1.55038157e+02
1716.lowfreq: -13.4346 -9.6294 -0.0022 -0.0015 -0.0012 2.3851 32.8220 39.5026 49.8196
frequency: 30.5018 39.4253 49.4783 76.7652 106.2700 140.6180 147.5239 159.4858 169.5516 185.9818 207.7418 220.3062 235.8094 244.3328 251.6456 271.5162 307.3563 336.7181 372.8675 420.0109 427.4916 454.2363 463.8166 502.4847 507.5703 525.7132 533.0690 542.8847 596.6252 645.7249 713.9176 716.6335 757.8841 770.0941 784.6677 793.0009 800.0235 817.6479 883.5557 902.8764 932.5898 971.5760 982.4021 990.8055 993.1376 995.1895 998.5548 1001.6421 1031.8629 1041.5590 1053.5518 1057.1535 1083.7296 1132.8722 1140.7728 1172.3503 1179.8086 1206.7219 1211.2727 1259.6479 1275.8090 1360.8272 1369.2345 1396.0618 1406.1593 1407.4909 1415.1285 1423.6625 1456.3546 1460.2612 1463.0099 1466.1577 1474.2216 1477.7156 1483.8496 1499.8126 1564.0845 1570.9117 1609.3114 1610.3455 2977.2160 2980.1382 2985.9519 3054.8275 3066.9537 3068.1167 3088.5664 3100.6058 3104.4971 3128.2874 3129.5861 3137.5087 3142.8951 3148.8070 3163.3625 3168.1348
redmass: 3.0218 4.5339 2.8732 1.5931 2.5761 1.9474 1.9112 1.1803 3.2220 3.2924 3.4586 5.1825 4.7696 6.1192 4.6826 4.9785 4.8566 2.4604 5.7360 4.0801 4.1964 3.7412 4.2484 4.4648 3.0817 4.2817 4.9130 5.3355 5.9988 6.9162 3.3774 2.8238 5.6341 1.2820 5.7461 4.1796 1.4516 4.6141 1.2865 13.3569 1.3175 1.3573 1.8062 2.2230 1.3507 2.4384 1.5094 1.3971 1.4364 2.0723 1.5432 1.6348 1.8835 1.4681 2.0994 1.0639 1.4406 2.4408 2.4871 1.8728 1.5025 6.0725 5.4877 1.2294 1.2198 1.2307 2.1070 2.2256 1.6499 2.2548 1.4095 1.1159 1.1989 1.0915 1.1054 1.0594 5.6357 5.3575 7.1431 6.9605 1.0380 1.0413 1.0379 1.0968 1.0933 1.0956 1.0987 1.1002 1.0985 1.0868 1.0877 1.0890 1.0905 1.0940 1.0992 1.1005
irintensity: 0.0610 0.8098 0.3975 0.6155 0.9078 1.1059 0.7303 0.8132 3.1202 1.3281 2.7432 0.7998 3.9120 6.0178 6.4997 0.3272 3.3636 0.9254 14.3650 9.2491 42.8451 11.3906 67.5706 4.1707 0.3954 21.9790 9.9279 32.8200 5.8591 3.5941 6.2641 12.1971 16.0674 92.1834 31.9233 32.6809 19.4970 3.7479 0.3658 81.4767 1.2027 0.5957 2.5046 0.5748 0.1465 1.3829 4.8937 0.2682 15.0218 7.3521 11.6913 2.3166 9.3955 4.5436 3.4577 3.7916 0.7930 24.8924 9.6341 1.7749 6.2377 4.2284 4.0055 5.3748 37.5772 4.7819 4.0706 1.1536 2.2492 23.0538 28.3497 10.5400 27.4422 12.8384 43.2862 28.4029 7.0645 0.9822 3.2226 1.0960 26.8282 13.1532 13.9628 18.4845 18.7418 10.6236 18.9077 12.4455 6.0205 2.7046 14.5356 12.5458 3.3172 6.9302 28.5799 30.5712
temp: 298.150 k
press: 1.00000 atm
elementType: 16 8 8 6 6 6 6 6 6 6 6 6 6 6 6 6 6 6 1 1 1 1 1 1 1 1 1 1 1 1 1 1 1 1
symmnumber: 1
zpe: 700933.2 jmol-1
zpe.correction: 0.266971 hartree
zpe.thermalcorrener: 0.285107 hartree
zpe.thermalcorrenthalpy: 0.286051 hartree
zpe.thermalcorrgfe: 0.220675 hartree
zpe.sumelectzpe: -1128.245106 hartree
zpe.sumelectthermal: -1128.226971 hartree
zpe.sumelectthermalent: -1128.226026 hartree
zpe.sumelectthermalfe: -1128.291403 hartree
dipole: -1.1534 3.9730 -5.5282
dipole: 6.9048
quadrupole: -96.2270 -112.8989 -122.1726
quadrupole: 5.1822 -1.8867 8.9804
quadrupole: 14.2059 -2.4661 -11.7398 5.1822 -1.8867 8.9804
hfenergy: -1128.5120777 hartree
pointgroup: C01 [X(C15H16O2S1)]
dipole: -0.3718913 1.1908241 -2.4131482 debye
polarizability: 223.1492348|19.9310569|188.8261266|6.3505392|9.7171977|151.3654318 unknown
InChI: InChI=1S/C15H16O2S/c1-11-8-6-10-15(13(11)3)18(16,17)14-9-5-4-7-12(14)2/h4-10H,1-3H3
charge 0 multiplicity 1
34 atoms
S  0.355847 -0.711913 1.453489
O  0.533108 -2.330728 1.645403
O  0.349689 0.251932 2.781239
C  -1.275635 -0.472085 0.465216
C  -1.770976 0.815216 0.152909
C  1.767213 -0.058548 0.333444
C  -3.009694 0.855619 -0.568065
C  2.105227 -0.707248 -0.878732
C  -1.915859 -1.681447 0.154007
C  2.453596 1.045864 0.862028
C  -1.041408 2.090892 0.53531
C  -3.667665 -0.355683 -0.900816
C  -3.139742 -1.615432 -0.542972
C  3.20735 -0.147511 -1.581163
C  -3.632022 2.181894 -0.971276
C  1.372835 -1.917728 -1.424219
C  3.546276 1.570766 0.137267
C  3.916135 0.971262 -1.088046
H  -1.461993 -2.628569 0.465706
H  2.137988 1.461536 1.825828
H  -0.528479 1.977632 1.504919
H  -0.278135 2.353286 -0.223137
H  -1.736064 2.942327 0.609704
H  -4.616893 -0.305962 -1.447085
H  -3.673737 -2.535296 -0.802052
H  3.511409 -0.61051 -2.527209
H  -3.932968 2.775962 -0.087319
H  -2.930474 2.8051 -1.555666
H  -4.533407 2.020131 -1.585904
H  1.902607 -2.330497 -2.298255
H  1.280856 -2.702156 -0.652998
H  0.346022 -1.656693 -1.742531
H  4.100554 2.429616 0.529104
H  4.76364 1.36837 -1.657528
