program: Gaussian 09
title: 000169016
version: EM64L-G09RevD.01
frameworkgroup: C1[X(C10H15N3O5)]
method: RPBEPBE
basis: SDD
operation: Freq
keyword: #p
keyword: freq=noraman
keyword: PBEPBE/SDD
title: #p freq=noraman PBEPBE/SDD
converged: YES YES NO NO
title: Mulliken charges:
elementType: O O O O O N N N C C C C C C C C C C H H H H H H H H H H H H H H H
charge: -0.257079 -0.430423 -0.479205 -0.254839 -0.471158 -0.214250 -0.052041 -0.628714 -0.117878 -0.014957 -0.538181 -0.054351 -0.371860 -0.191458 0.022310 0.180993 0.084165 -0.460093 0.208506 0.284778 0.249422 0.270549 0.286876 0.194271 0.214971 0.336990 0.356412 0.392846 0.255059 0.192546 0.308908 0.344228 0.352658
chargesum: 0.00000
title: Mulliken charges with hydrogens summed into heavy atoms:
elementType: O O O O O N N N C C C C C C C C C C
charge: -0.257079 -0.093433 -0.086359 -0.254839 -0.118500 -0.214250 -0.052041 0.024422 0.090628 0.269821 -0.018210 0.232525 0.037381 0.164954 0.022310 0.180993 0.084165 -0.012488
polarizability: 1.91900825e+02 -1.39681134e+01 1.54024412e+02 5.96837543e+00 5.62045029e+00 9.62987247e+01
1716.lowfreq: -6.6144 -0.0007 -0.0006 -0.0003 6.0741 7.7110 45.6359 57.8863 78.8352
frequency: 45.5472 57.8397 78.8251 90.3855 121.5059 126.3639 150.3797 180.7342 199.7773 208.3220 216.3824 263.7151 282.5091 285.7183 311.3564 328.6446 361.5555 371.1488 388.4759 425.0785 429.7969 454.3015 459.1456 513.5236 533.0385 552.7477 591.7222 600.7115 657.7476 674.0950 711.1863 719.9949 740.6661 751.8091 758.5022 792.0583 816.3939 851.3901 861.5365 911.1344 937.3807 956.1268 968.4570 991.9899 995.0606 1003.6206 1014.2631 1042.6252 1043.7042 1055.9623 1074.2260 1125.8697 1165.7010 1178.2352 1185.5948 1221.2592 1230.5940 1235.6107 1244.9597 1273.0479 1283.6412 1285.9264 1313.4746 1326.6816 1334.2401 1338.3782 1355.7008 1376.6485 1382.0759 1421.4867 1444.7367 1451.0049 1472.4699 1475.8095 1498.0153 1585.5939 1623.8219 1642.4889 2929.3209 2970.5658 2979.0400 3003.3961 3045.1758 3083.5813 3093.8405 3100.9623 3109.8664 3127.2950 3299.6112 3539.9384 3555.9162 3564.8639 3696.7585
redmass: 4.4896 5.6374 4.7455 4.1332 5.8036 6.1735 5.4759 5.1767 3.9992 6.9428 3.2516 4.7447 1.2441 2.3779 4.0804 5.0014 4.5385 2.2266 1.8336 1.7841 1.9559 3.1647 2.9792 3.1822 3.4349 5.0290 1.6704 2.9562 2.4883 1.4393 5.7345 6.7792 6.1461 8.7753 4.7898 3.4429 3.1070 3.1333 8.1907 2.7316 2.5926 1.9624 3.7563 2.0075 1.5639 2.5036 4.6582 3.0847 3.5789 2.2441 2.8583 1.2724 1.2629 2.4902 1.2969 1.3195 1.7288 1.5505 1.3855 1.4532 1.3435 1.3412 1.4312 1.2531 1.2075 1.2618 1.1748 2.6707 1.5708 1.3742 1.2279 1.8331 1.0788 1.4995 4.9985 2.8017 1.8596 6.8024 1.0556 1.0876 1.1023 1.0665 1.0629 1.0896 1.0988 1.0890 1.1022 1.0952 1.0705 1.0455 1.0663 1.0663 1.1035
irintensity: 0.3912 10.1557 3.1715 4.0427 19.2994 1.4400 7.4497 2.6692 3.2437 5.5771 5.1805 14.7674 142.3686 12.6749 1.7552 3.0368 5.3440 51.1958 45.4313 90.0435 125.3695 11.7962 34.2244 25.2951 82.9434 6.0814 68.4156 28.1921 28.5036 162.2227 15.0304 0.6881 15.3211 25.3520 11.7763 16.5687 18.5217 10.8932 119.8459 19.7882 54.1371 18.0975 41.3181 23.0560 25.3657 23.2701 171.4801 39.8022 45.2783 5.4974 36.9132 10.7195 12.8393 14.8500 8.0499 5.9763 19.1378 25.6938 21.3662 101.3319 45.4527 6.8905 12.8489 6.8366 60.0231 2.5495 17.8054 18.1831 3.3642 7.6364 28.3397 137.4335 4.5514 45.8824 207.1772 190.5978 197.0654 679.7210 42.3492 44.1891 82.7790 73.7042 9.1931 6.9355 9.5917 10.1149 18.2336 35.1614 302.7271 88.2241 6.6765 6.7096 34.0577
temp: 298.150 k
press: 1.00000 atm
elementType: 8 8 8 8 8 7 7 7 6 6 6 6 6 6 6 6 6 6 1 1 1 1 1 1 1 1 1 1 1 1 1 1 1
symmnumber: 1
zpe: 679074.4 jmol-1
zpe.correction: 0.258646 hartree
zpe.thermalcorrener: 0.275850 hartree
zpe.thermalcorrenthalpy: 0.276795 hartree
zpe.thermalcorrgfe: 0.214528 hartree
zpe.sumelectzpe: -929.031300 hartree
zpe.sumelectthermal: -929.014096 hartree
zpe.sumelectthermalent: -929.013151 hartree
zpe.sumelectthermalfe: -929.075418 hartree
dipole: -3.6501 2.2600 -3.4430
dipole: 5.5032
quadrupole: -80.0905 -132.0238 -102.6516
quadrupole: -14.7386 -6.8832 -5.5417
quadrupole: 24.8315 -27.1019 2.2704 -14.7386 -6.8832 -5.5417
hfenergy: -929.2899461 hartree
pointgroup: C01 [X(C10H15N3O5)]
dipole: -1.2925881 -1.2170275 1.2392593 debye
polarizability: 186.9448771|19.4583919|157.607039|-4.4744254|10.5364967|97.6720456 unknown
InChI: InChI=1S/C10H15N3O5/c11-9-5(3-14)2-13(10(17)12-9)8-1-6(16)7(4-15)18-8/h2,6-8,14-16H,1,3-4,11H2
charge 0 multiplicity 1
33 atoms
O  1.92408 -0.054423 -1.162746
O  4.419982 0.808737 0.304104
O  1.214044 -2.773596 -0.277991
O  -0.507102 2.956918 0.495674
O  -1.572929 -3.146242 0.300232
N  -0.184845 0.811959 -0.381153
N  -2.339696 1.468777 0.499663
N  -4.111061 -0.018281 0.567015
C  3.139734 0.337449 0.848867
C  1.288735 1.115271 -0.585435
C  2.009352 1.402289 0.765277
C  2.655641 -0.786775 -0.086155
C  1.788559 -1.823321 0.665839
C  -0.683655 -0.407632 -0.733527
C  -1.026737 1.831865 0.238021
C  -1.982323 -0.792772 -0.41893
C  -2.799474 0.228063 0.213963
C  -2.342822 -2.241653 -0.627508
H  3.277306 -0.017185 1.891999
H  1.362825 1.94388 -1.305774
H  1.305627 1.308517 1.608449
H  2.401261 2.431356 0.784803
H  3.494559 -1.283961 -0.596462
H  1.001083 -1.30823 1.259159
H  2.458618 -2.350111 1.379708
H  4.687884 1.638756 0.773528
H  0.026713 -1.089197 -1.214935
H  0.292155 -3.051012 0.008274
H  -2.035303 -2.602558 -1.621347
H  -3.423647 -2.448908 -0.508954
H  -4.601363 -0.865392 0.295676
H  -4.627774 0.753266 0.987277
H  -1.837029 -2.942954 1.23389
