program: Gaussian 09
title: 000168997
version: EM64L-G09RevD.01
frameworkgroup: C1[X(C8H17NO3)]
method: RPBEPBE
basis: SDD
operation: Freq
keyword: #p
keyword: freq=noraman
keyword: PBEPBE/SDD
title: #p freq=noraman PBEPBE/SDD
converged: YES YES NO NO
title: Mulliken charges:
elementType: O O O N C C C C C C C C H H H H H H H H H H H H H H H H H
charge: -0.459461 -0.445522 -0.220745 -0.147249 -0.026509 -0.472067 -0.123761 -0.053400 -0.630524 -0.637226 -0.714681 -0.106654 0.249474 0.196367 0.235092 0.224061 0.209439 0.204783 0.229327 0.225517 0.199544 0.242059 0.224833 0.211046 0.235308 0.241382 0.219513 0.359815 0.330238
chargesum: 0.00000
title: Mulliken charges with hydrogens summed into heavy atoms:
elementType: O O O N C C C C C C C C
charge: -0.099646 -0.115284 -0.220745 -0.147249 0.222965 -0.040607 0.100301 0.156039 0.029103 0.029209 -0.026945 0.112859
polarizability: 1.14316749e+02 9.31032649e+00 1.02912318e+02 -6.33615454e-01 -3.11825693e+00 9.59836264e+01
1716.lowfreq: -14.2857 -12.2203 -9.3674 0.0007 0.0008 0.0009 39.3675 67.6245 69.7599
frequency: 39.1749 67.5463 69.7322 96.0421 124.8716 139.3248 183.4859 214.5781 220.2717 240.1364 259.2531 272.2232 284.3293 304.5783 305.6595 325.9329 362.5293 418.4151 438.9654 463.3283 481.6096 512.6926 557.2774 705.6426 795.0820 813.8512 846.6337 883.3271 908.2464 937.4794 976.5046 1008.9190 1037.5762 1052.2433 1070.8699 1084.9386 1087.1148 1102.9979 1124.6805 1132.5251 1182.0555 1195.0970 1224.2671 1246.7472 1253.2980 1278.2232 1292.2935 1301.5977 1322.2784 1335.0299 1358.7588 1368.8267 1377.0990 1396.5032 1423.5518 1446.9183 1456.0696 1466.2674 1469.2413 1475.3701 1479.8885 1486.6506 1490.2599 1602.4525 2874.7660 2883.6129 2911.5546 2949.9605 2955.0455 2978.8574 2987.7605 2993.9083 3023.4832 3031.0505 3044.8158 3077.9354 3092.2429 3098.3590 3109.5786 3418.7658 3550.6012
redmass: 4.3709 2.9877 4.1776 3.4315 3.0882 4.8147 3.3352 1.2561 1.2914 1.5342 1.3959 3.5413 2.2907 1.7056 2.0544 3.4624 3.4372 2.5554 2.3851 1.2740 2.5321 2.4020 2.3519 4.4450 3.2936 4.2779 2.8976 1.7844 2.6766 1.6569 1.6490 2.4817 1.4878 2.0943 2.2474 1.4620 1.7353 2.4546 1.9769 1.4299 1.4548 2.1246 1.4755 1.4224 1.8947 1.2658 1.4081 1.2334 1.2623 1.2623 1.4131 1.3818 1.3536 1.4969 1.1351 1.1521 1.0795 1.0514 1.0575 1.0545 1.0447 1.0541 1.0553 7.9741 1.0556 1.0560 1.0820 1.0801 1.0653 1.0886 1.0836 1.0376 1.0754 1.0769 1.0960 1.1008 1.0990 1.0978 1.0995 1.0645 1.0661
irintensity: 0.2188 2.0941 0.0939 2.4502 1.5139 1.1113 4.1427 0.8678 2.1884 3.5753 7.5473 30.3269 36.5567 53.8034 53.0438 6.2572 6.8034 13.7893 3.8292 122.3370 29.8215 6.4963 3.5383 8.8063 17.0575 12.1298 5.4026 24.3484 29.6448 14.8410 35.3485 75.3003 6.6794 52.8950 24.2845 1.4854 26.9090 17.6095 20.2534 6.6429 55.2225 43.2990 14.0242 38.7978 9.0326 8.0103 31.5940 26.8211 12.0112 16.5759 15.9614 15.6733 21.3997 31.3694 5.7811 5.7389 8.2906 11.6186 2.8181 10.2008 28.5828 11.4501 8.0781 140.6373 62.0259 155.2735 45.3965 23.2362 30.5448 54.8160 22.6142 19.5714 39.8922 42.4093 34.7119 37.0773 34.6141 29.9725 17.8089 27.2081 6.1637
temp: 298.150 k
press: 1.00000 atm
elementType: 8 8 8 7 6 6 6 6 6 6 6 6 1 1 1 1 1 1 1 1 1 1 1 1 1 1 1 1 1
symmnumber: 1
zpe: 645155.8 jmol-1
zpe.correction: 0.245727 hartree
zpe.thermalcorrener: 0.260643 hartree
zpe.thermalcorrenthalpy: 0.261587 hartree
zpe.thermalcorrgfe: 0.204319 hartree
zpe.sumelectzpe: -594.417449 hartree
zpe.sumelectthermal: -594.402534 hartree
zpe.sumelectthermalent: -594.401589 hartree
zpe.sumelectthermalfe: -594.458857 hartree
dipole: -3.5470 -1.1224 -0.7792
dipole: 3.8011
quadrupole: -75.6612 -82.1131 -74.3234
quadrupole: 3.9754 -0.9178 1.4197
quadrupole: 1.7047 -4.7472 3.0426 3.9754 -0.9178 1.4197
hfenergy: -594.6631762 hartree
pointgroup: C01 [X(C8H17N1O3)]
dipole: 1.2917878 0.6851643 -0.3134749 debye
polarizability: 110.5439827|10.7256881|106.8214049|-0.0963299|3.0120723|95.8473058 unknown
InChI: InChI=1S/C8H17NO3/c1-6(11)4-7(9(2)3)8(12)5-10/h5-8,11-12H,4H2,1-3H3
charge 0 multiplicity 1
29 atoms
O  -0.198045 -1.716356 1.477732
O  -3.064505 0.877993 -0.871378
O  -0.075608 -2.822318 -0.998713
N  1.879759 0.936627 -0.123658
C  0.57999 0.405849 0.398355
C  -0.640537 0.798986 -0.469582
C  0.762355 -1.150647 0.546919
C  -2.028474 0.328681 0.039878
C  2.865873 1.141743 0.961352
C  1.845696 2.1042 -1.029673
C  -2.392626 0.849959 1.432328
C  0.701051 -1.849115 -0.798826
H  0.396257 0.777978 1.43311
H  -0.500181 0.421115 -1.505303
H  -0.697749 1.901514 -0.536698
H  1.788168 -1.315923 0.942483
H  -2.084547 -0.778229 0.03422
H  2.605146 2.003627 1.623343
H  3.864786 1.328325 0.528338
H  2.938697 0.243323 1.599199
H  1.503651 3.04843 -0.539244
H  1.197989 1.913652 -1.899237
H  2.868919 2.276471 -1.410254
H  -2.270825 1.94748 1.483131
H  -3.448692 0.612754 1.64597
H  -1.763755 0.370226 2.20038
H  1.381125 -1.45612 -1.585522
H  -0.618367 -2.502725 1.025939
H  -2.953451 0.467999 -1.767189
