program: Gaussian 09
title: 000168962
version: EM64L-G09RevD.01
frameworkgroup: C1[X(C12H10N2O6S2)]
method: RPBEPBE
basis: SDD
operation: Freq
keyword: #p
keyword: freq=noraman
keyword: PBEPBE/SDD
title: #p freq=noraman PBEPBE/SDD
converged: YES YES NO NO
title: Mulliken charges:
elementType: S S O O O O O O N N C C C C C C C C C C C C H H H H H H H H H H
charge: 0.997359 0.997359 -0.566421 -0.566426 -0.495952 -0.495578 -0.495950 -0.495580 -0.104544 -0.104478 -0.061624 -0.061647 0.190788 0.190718 -0.202340 -0.202356 -0.207388 -0.207360 -0.261051 -0.260992 -0.316704 -0.316716 0.285991 0.285986 0.290631 0.290631 0.290219 0.290226 0.269741 0.269743 0.386856 0.386856
chargesum: 0.00000
title: Mulliken charges with hydrogens summed into heavy atoms:
elementType: S S O O O O O O N N C C C C C C C C C C C C
charge: 0.997359 0.997359 -0.179565 -0.179571 -0.495952 -0.495578 -0.495950 -0.495580 -0.104544 -0.104478 -0.061624 -0.061647 0.190788 0.190718 0.083651 0.083629 0.083243 0.083271 0.029168 0.029234 -0.046963 -0.046973
polarizability: 5.05844529e+02 -1.02097229e+01 1.97708434e+02 -2.20987205e-03 6.34205847e-04 1.18793757e+02
1716.lowfreq: -1.7373 -0.0014 0.0009 0.0016 5.4977 10.2241 17.8994 22.0972 35.3646
frequency: 17.8948 22.0945 35.3175 39.8355 42.1730 54.3883 101.5099 106.2816 127.8415 131.7073 143.1985 172.1644 175.3728 197.8772 210.7128 230.4147 234.2763 274.7370 285.0316 302.3822 310.3647 333.2739 354.1217 363.8995 378.5487 394.0388 413.3729 416.2519 417.4797 455.5911 502.1215 519.5685 538.3031 552.3316 572.5360 600.4279 610.2614 620.2599 690.7008 726.4404 746.6362 805.5630 835.3388 835.7079 847.7255 849.6011 860.6289 874.1156 894.2743 969.0461 969.0923 985.5060 987.1953 988.9783 989.3303 1000.4004 1000.4452 1040.2602 1040.8196 1053.1544 1053.9390 1102.7387 1107.9827 1134.6993 1155.4700 1178.8050 1225.1355 1283.6327 1285.9235 1361.2329 1389.0875 1397.2425 1399.7751 1411.6022 1452.2630 1459.1341 1577.1104 1578.7965 1591.4586 1592.6741 3158.8026 3158.8999 3161.4052 3161.4509 3178.4011 3178.4357 3180.8013 3180.9727 3479.9227 3479.9589
redmass: 7.6604 9.7300 5.1544 9.5172 4.1772 7.1864 9.1592 8.6169 8.0101 12.9163 9.2808 1.5741 1.4199 8.4592 7.3956 11.1915 3.8224 3.1853 4.1342 9.4707 8.4913 9.7746 10.8773 7.7625 6.3965 4.7540 3.0819 3.6599 11.2094 9.2274 3.6912 6.2467 6.2885 8.1295 4.1790 8.4160 7.1187 7.3237 7.0350 3.7615 3.3820 6.3280 13.3859 12.1875 1.2418 1.2419 1.4861 1.6124 6.9276 16.5630 16.7462 1.5044 1.8531 3.5238 2.5216 1.3697 1.3731 1.6091 1.5958 1.5452 1.6024 1.3851 1.2770 2.2820 1.2366 1.4546 3.5011 1.2761 1.2785 7.3832 6.3040 10.9145 3.9358 3.7220 2.1818 2.3297 6.6217 6.8983 7.0162 7.5758 1.0897 1.0897 1.0890 1.0890 1.0969 1.0969 1.0968 1.0968 1.0661 1.0662
irintensity: 0.0271 0.6850 2.7458 0.9507 0.0487 0.6865 0.0085 0.0731 0.1135 0.4580 7.6544 0.4666 107.8448 6.3964 13.7590 25.7692 0.0003 143.8245 0.9694 3.6099 13.2203 0.1249 11.7476 0.1754 0.1796 1.2508 4.5285 0.1439 210.0940 0.2159 50.6834 22.4538 61.9112 49.3621 231.1543 159.7169 0.0523 0.6996 13.8428 0.0485 4.2083 4.9099 72.4633 120.7744 0.0292 1.0585 2.3456 122.5404 0.1602 4.1481 181.1603 4.5345 0.3382 13.0901 0.9144 0.1849 0.6940 3.3426 55.6305 128.3103 61.5345 0.0000 9.7162 0.0720 3.5286 0.1636 19.3904 0.9818 0.0004 0.0011 6.8391 0.0041 63.4355 0.0027 0.1061 13.5994 0.0146 1.1231 0.6806 0.0026 5.5849 0.0402 4.6440 0.0831 2.9329 0.4041 0.3016 0.0115 43.2933 65.2319
temp: 298.150 k
press: 1.00000 atm
elementType: 16 16 8 8 8 8 8 8 7 7 6 6 6 6 6 6 6 6 6 6 6 6 1 1 1 1 1 1 1 1 1 1
symmnumber: 1
zpe: 540153.9 jmol-1
zpe.correction: 0.205734 hartree
zpe.thermalcorrener: 0.228098 hartree
zpe.thermalcorrenthalpy: 0.229042 hartree
zpe.thermalcorrgfe: 0.151091 hartree
zpe.sumelectzpe: -1818.250297 hartree
zpe.sumelectthermal: -1818.227933 hartree
zpe.sumelectthermalent: -1818.226989 hartree
zpe.sumelectthermalfe: -1818.304940 hartree
dipole: 0.0002 0.0003 2.7481
dipole: 2.7481
quadrupole: -188.0989 -137.9917 -148.0745
quadrupole: -1.4329 -0.0023 -0.0051
quadrupole: -30.0439 20.0633 9.9805 -1.4329 -0.0023 -0.0051
hfenergy: -1818.4560307 hartree
pointgroup: C01 [X(C12H10N2O6S2)]
dipole: 0.0000491 -1.0811941 0.0022867 debye
polarizability: 504.6583234|-0.0559135|118.7940787|-21.6411886|0.1604323|198.894318 unknown
InChI: InChI=1S/C12H10N2O6S2/c15-21(16,17)11-5-1-9(2-6-11)13-14-10-3-7-12(8-4-10)22(18,19)20/h1-8,15,18H
charge 0 multiplicity 1
32 atoms
S  6.40438 0.220591 -0.16236
S  -6.404019 0.22185 0.161181
O  6.579236 -1.62733 -0.110013
O  -6.579216 -1.626234 0.116302
O  7.017505 0.764499 -1.556379
O  6.897058 0.828799 1.252952
O  -7.017284 0.7716 1.552851
O  -6.896295 0.82436 -1.256712
N  0.345149 0.225577 -0.554456
N  -0.344975 0.226924 0.554804
C  4.530833 0.208036 -0.245231
C  -4.530509 0.209259 0.244547
C  1.767312 0.22203 -0.365823
C  -1.767035 0.22316 0.36583
C  3.818304 0.208797 0.969022
C  -3.817659 0.204885 -0.969514
C  3.934311 0.217258 -1.515446
C  -3.934326 0.22345 1.514883
C  2.414349 0.218021 0.903699
C  -2.413727 0.214109 -0.903849
C  2.52562 0.227191 -1.566223
C  -2.525655 0.233203 1.56601
H  4.350693 0.216385 1.925202
H  -4.3498 0.208585 -1.925855
H  4.546678 0.230558 -2.421904
H  -4.546955 0.240551 2.421101
H  1.803263 0.218568 1.810398
H  -1.802382 0.210862 -1.810378
H  1.992552 0.234769 -2.521495
H  -1.992817 0.244378 2.521377
H  7.555675 -1.841298 -0.045699
H  -7.555666 -1.840293 0.052481
