program: Gaussian 09
title: 000168886
version: EM64L-G09RevD.01
frameworkgroup: C1[X(C6H13NO3)]
method: RPBEPBE
basis: SDD
operation: Freq
keyword: #p
keyword: freq=noraman
keyword: PBEPBE/SDD
title: #p freq=noraman PBEPBE/SDD
converged: YES YES NO NO
title: Mulliken charges:
elementType: O O O N C C C C C C H H H H H H H H H H H H H
charge: -0.425934 -0.407491 -0.323405 -0.099898 -0.346551 -0.466790 -0.582043 -0.557481 -0.347799 0.153359 0.326565 0.242677 0.246644 0.251889 0.221518 0.235615 0.335048 0.252432 0.241940 0.257266 0.220287 0.218659 0.353491
chargesum: 0.00000
title: Mulliken charges with hydrogens summed into heavy atoms:
elementType: O O O N C C C C C C
charge: -0.072443 -0.407491 -0.323405 -0.099898 0.222691 0.031743 0.210139 0.194156 0.091147 0.153359
polarizability: 9.99354881e+01 3.39418310e+00 8.25601389e+01 4.18832994e+00 -1.77495932e+00 7.02910904e+01
1716.lowfreq: -9.8714 -0.0005 -0.0002 0.0004 10.4375 22.0473 56.5612 72.0615 85.9070
frequency: 56.5041 71.9930 85.8473 148.0049 176.1295 211.5637 233.3708 289.8508 295.9063 327.1796 330.5024 350.5881 365.9715 408.9277 455.2029 537.7438 555.2437 651.6307 749.3356 806.1559 818.6858 825.5449 894.5154 957.6145 963.5700 978.9167 1047.6783 1062.4843 1097.0445 1114.2163 1163.1190 1191.5202 1213.2910 1224.8450 1257.7502 1276.4988 1316.1723 1324.5841 1370.1117 1386.5675 1406.3583 1412.5730 1433.2235 1463.0839 1468.2157 1474.4455 1480.7338 1491.5734 1505.2079 1617.6300 2951.7531 2985.0574 2992.5491 3013.4492 3023.9298 3062.5362 3082.5509 3105.2824 3109.7000 3125.5355 3132.1161 3133.3119 3558.7029
redmass: 4.0190 3.4911 2.9672 2.8749 2.7557 1.2922 3.4803 1.2764 4.9216 2.4298 4.0583 2.2365 1.2032 2.3287 2.4888 3.1258 3.4630 6.8126 4.1416 2.2563 2.4136 2.6244 2.6972 2.7313 2.5175 3.9217 1.4831 2.5787 1.3253 1.2710 1.2974 1.6132 4.0519 1.5247 1.4235 1.5631 1.3483 1.1488 1.1914 1.2217 1.1987 1.0976 1.1451 1.0578 1.0607 1.0741 1.0644 1.0917 1.0491 8.1712 1.0686 1.0623 1.0364 1.0328 1.0562 1.0961 1.1021 1.1084 1.1025 1.1037 1.1040 1.1038 1.0666
irintensity: 5.3690 10.8706 7.5499 7.7399 2.3200 3.4965 7.8765 1.1229 1.6350 1.1030 4.4971 10.3164 171.2892 10.8879 5.2888 1.6350 3.0814 47.4572 0.0751 31.4882 45.3508 17.2892 18.8920 40.7071 12.9716 67.9969 2.8612 2.8686 9.8537 18.5424 9.1890 48.3182 106.2548 16.1828 1.5033 2.6210 4.3168 36.2665 6.7526 21.0815 102.8732 4.3738 34.7639 3.4422 19.8282 1.2527 28.6795 22.7306 38.4169 339.6867 83.4543 29.7088 75.6180 17.7932 10.3236 20.9983 18.8935 7.6016 11.4713 10.4293 12.0800 20.0180 15.8679
temp: 298.150 k
press: 1.00000 atm
elementType: 8 8 8 7 6 6 6 6 6 6 1 1 1 1 1 1 1 1 1 1 1 1 1
symmnumber: 1
zpe: 506151.4 jmol-1
zpe.correction: 0.192783 hartree
zpe.thermalcorrener: 0.204490 hartree
zpe.thermalcorrenthalpy: 0.205434 hartree
zpe.thermalcorrgfe: 0.155387 hartree
zpe.sumelectzpe: -515.970311 hartree
zpe.sumelectthermal: -515.958604 hartree
zpe.sumelectthermalent: -515.957660 hartree
zpe.sumelectthermalfe: -516.007706 hartree
dipole: 7.3605 7.1004 0.5872
dipole: 10.2439
quadrupole: -92.0909 -56.8152 -59.6185
quadrupole: -9.1072 1.8173 0.7464
quadrupole: -22.5827 12.6930 9.8897 -9.1072 1.8173 0.7464
hfenergy: -516.1630935 hartree
pointgroup: C01 [X(C6H13N1O3)]
dipole: -3.0475386 2.6229452 0.2752267 debye
dipolederiv: -0.5556911 -0.2653244 -0.2049539 -0.3348651 -0.6077959 0.0824482 -0.2020352 0.0698461 -0.4169451 -0.9810655 0.0276704 -0.2199803 -0.0814219 -0.6973834 -0.2979577 -0.3136593 -0.2330075 -0.9168405 -1.2504803 0.170782 -0.2788967 0.193584 -0.5409394 -0.059804 -0.2722164 -0.0713091 -0.619467 -0.6085015 0.0516546 -0.0303437 0.026691 -0.376556 0.0072466 -0.0618223 0.0209414 -0.3019949 -0.019584 0.1613862 0.0157818 0.34643 0.2305764 -0.045307 0.0224216 -0.0297337 0.0607695 0.5112101 -0.0649735 0.1052488 0.0017116 -0.0210469 -0.2205633 0.2511901 -0.2817346 0.0165411 0.0768735 0.0855549 -0.0126108 0.0928678 -0.0275987 -0.0613959 0.014584 -0.1302367 0.2100265 0.0645339 -0.0196025 -0.0151146 -0.0661097 0.1697641 0.0686168 -0.0515235 0.1114823 0.1547009 0.429679 0.1275895 0.0236336 0.1482619 0.4860972 -0.0214357 0.0840052 0.0141796 0.3453219 1.4727787 -0.3021665 0.4248907 -0.2485013 0.6996877 0.5413273 0.5085317 0.5101551 0.9259759 0.3553441 0.0157625 -0.0211308 -0.0743259 0.0438838 -0.0049573 -0.1415606 -0.039909 0.0903955 0.054521 -0.0431691 -0.0206206 -0.0066704 0.0755314 0.0034618 -0.0004319 0.0254247 -0.0976629 0.0214971 -0.0168494 -0.0167957 -0.0301386 -0.1006125 -0.0078486 -0.0297218 0.0457687 0.0958042 0.0027235 0.0192923 0.0812022 -0.0078412 0.0967515 0.0441374 0.037127 0.0227098 -0.0585337 -0.1050497 0.0710894 -0.0819501 0.0615362 0.0964965 0.0450452 -0.0160359 0.0224796 0.0573182 0.0367667 -0.1187769 -0.0018294 -0.0941344 -0.0218286 0.0322041 -0.0309083 -0.0459563 0.0774883 0.200068 -0.0531733 0.0648342 -0.1093666 0.1860414 -0.1280898 0.0274063 -0.0269701 0.1130617 0.0247438 -0.1301543 0.0047331 -0.0603014 -0.0094498 -0.0147812 0.0240402 0.0171219 0.1012898 -0.0985091 0.0978004 -0.0370792 0.0641994 0.0798305 -0.0190604 -0.0857698 0.0092598 0.0494166 0.1108522 0.0149027 0.0046694 -0.0025437 0.0719353 0.0950447 0.0351793 0.02791 -0.0490679 -0.013153 0.0755805 0.0285429 0.078963 -0.0759344 -0.0358526 0.0364614 -0.0707083 0.0463712 0.0342566 -0.0442222 0.0387976 -0.0145768 0.0041472 0.0567486 0.0086889 0.0875921 -0.1625927 0.2361858 0.1393467 0.1489714 0.1165519 0.2384025 -0.0592273 0.1560493 -0.0553058 0.2786235 unknown
polarizability: 99.9038531|-3.5820734|80.67668|4.550897|4.3714074|72.2061844 unknown
InChI: InChI=1S/C6H13NO3/c1-7(2,3-4-8)5-6(9)10/h8H,3-5H2,1-2H3
charge 0 multiplicity 1
23 atoms
O  -3.164367 -1.660594 -0.098329
O  1.450065 -1.167708 -1.008608
O  3.170675 -0.672838 0.517362
N  -0.25764 0.857105 0.160345
C  -1.08157 -0.44648 0.243586
C  1.162713 0.554756 0.747523
C  -0.091792 1.306208 -1.290009
C  -0.906499 1.961542 0.975014
C  -2.475224 -0.404262 -0.411712
C  2.012956 -0.553591 -0.009392
H  -0.428793 -1.199124 -0.243965
H  -1.190961 -0.682202 1.317134
H  1.71997 1.507699 0.730413
H  1.011148 0.240215 1.795115
H  -1.069978 1.60378 -1.697775
H  0.598723 2.164702 -1.306778
H  0.351702 0.452811 -1.830679
H  -0.254657 2.848968 0.950881
H  -1.890513 2.216795 0.55109
H  -1.024154 1.617825 2.014516
H  -3.129718 0.372327 0.018403
H  -2.405144 -0.25032 -1.507033
H  -2.695843 -2.414314 -0.540101
