program: Gaussian 09
title: 000168887
version: EM64L-G09RevD.01
frameworkgroup: C1[X(C6H14NO3)]
method: RPBEPBE
basis: SDD
operation: Freq
keyword: #p
keyword: freq=noraman
keyword: PBEPBE/SDD
title: #p freq=noraman PBEPBE/SDD
converged: YES YES NO NO
title: Mulliken charges:
elementType: O O O N C C C C C C H H H H H H H H H H H H H H
charge: -0.436742 -0.383338 -0.211216 -0.120756 -0.318605 -0.409703 -0.536907 -0.572193 -0.334486 0.212443 0.275439 0.320145 0.307799 0.313875 0.265285 0.266131 0.273117 0.259421 0.262374 0.319522 0.230375 0.209068 0.383348 0.425602
chargesum: 1.00000
title: Mulliken charges with hydrogens summed into heavy atoms:
elementType: O O O N C C C C C C
charge: -0.053394 0.042264 -0.211216 -0.120756 0.276980 0.211972 0.267626 0.269123 0.104958 0.212443
polarizability: 9.00879522e+01 1.11990037e+00 7.51842022e+01 -4.56888085e+00 -2.40986479e+00 6.85157199e+01
1716.lowfreq: -15.6864 -0.0013 -0.0012 -0.0011 8.6859 11.6250 39.1921 56.1654 84.0010
frequency: 39.1445 55.9579 83.9451 116.6875 171.8490 203.4850 228.5363 259.6128 273.5051 309.9558 322.2868 334.9126 353.4736 402.2562 455.8038 515.1256 549.1538 620.0805 650.2425 748.7760 825.4481 850.3151 887.9330 941.1108 952.3147 974.8147 1002.6475 1049.4429 1060.1534 1064.6001 1111.3631 1153.4830 1188.5394 1212.8672 1231.4722 1236.5623 1275.5145 1284.2736 1318.2429 1363.7859 1377.7839 1423.0137 1425.7428 1431.6152 1449.4638 1464.3942 1468.4569 1470.4960 1488.7198 1493.4942 1499.5455 1670.8417 2959.3523 3015.7668 3029.2880 3031.2429 3035.5401 3045.5449 3103.4452 3135.0141 3142.8476 3144.3588 3159.5039 3165.8741 3513.8539 3590.3145
redmass: 3.7248 4.6862 2.4685 3.2288 3.0105 1.4587 2.2159 1.1066 1.1820 3.4712 2.8686 4.1101 2.5607 2.5663 2.4220 2.2004 3.0418 4.3535 1.3532 3.9788 1.2966 3.3265 3.0786 2.4986 3.1046 4.1741 2.2688 2.0697 2.0319 1.5390 1.3591 1.4863 1.3170 1.4107 1.5674 1.3006 1.3445 1.6304 1.2545 1.2867 1.6952 1.1654 1.2165 1.1837 1.1302 1.0786 1.0524 1.0747 1.0571 1.0618 1.0726 8.9102 1.0562 1.1049 1.0340 1.0355 1.0574 1.0613 1.1047 1.1058 1.1056 1.1055 1.1043 1.1062 1.0650 1.0675
irintensity: 6.4999 10.3409 0.4626 5.0051 3.6908 1.6090 1.4056 168.6439 1.0123 0.4996 5.8144 19.1243 4.3331 1.4524 1.5787 35.3432 35.5919 21.8051 151.6401 7.3801 10.1251 39.8978 66.0365 18.7443 47.8170 50.8484 5.9376 1.6817 227.9060 8.4723 5.6900 1.8219 5.7807 15.6555 16.8162 7.1462 3.2053 12.4653 8.9084 12.5849 58.9950 10.8772 35.4035 6.6581 8.4754 5.0394 9.3785 17.9783 45.5066 59.4965 20.6021 203.8508 55.2819 34.0116 3.3605 7.6277 1.0392 4.8761 0.1241 1.4956 3.4283 5.9452 4.7481 0.4095 112.9995 39.8993
temp: 298.150 k
press: 1.00000 atm
elementType: 8 8 8 7 6 6 6 6 6 6 1 1 1 1 1 1 1 1 1 1 1 1 1 1
symmnumber: 1
zpe: 540802.9 jmol-1
zpe.correction: 0.205981 hartree
zpe.thermalcorrener: 0.218121 hartree
zpe.thermalcorrenthalpy: 0.219065 hartree
zpe.thermalcorrgfe: 0.167612 hartree
zpe.sumelectzpe: -516.355142 hartree
zpe.sumelectthermal: -516.343002 hartree
zpe.sumelectthermalent: -516.342058 hartree
zpe.sumelectthermalfe: -516.393510 hartree
dipole: -0.7092 4.3696 0.5776
dipole: 4.4643
quadrupole: -31.7271 -49.7914 -55.8758
quadrupole: -3.1049 -5.2188 0.1094
quadrupole: 14.0710 -3.9933 -10.0777 -3.1049 -5.2188 0.1094
hfenergy: -516.5611229 hartree
pointgroup: C01 [X(C6H14N1O3)]
dipole: 0.2079642 1.7436072 0.0386003 debye
dipolederiv: -0.5818564 0.2207389 -0.1890253 0.2363014 -0.6559709 -0.0821837 -0.1940683 -0.057657 -0.3577185 -1.1908333 -0.1614123 0.3784785 -0.2193478 -0.3825717 0.1624678 0.336488 0.1312412 -0.4892436 -0.7033328 -0.1385972 0.1248337 0.0401511 -0.4959532 -0.264286 0.3221201 -0.1338154 -0.6833121 -0.3622391 0.0135371 -0.0046121 0.0468824 -0.3416052 -0.0146175 0.0057184 0.0019451 -0.3157088 0.1876155 -0.209538 0.0286215 -0.3071538 0.2896451 -0.0291183 0.066341 -0.0359861 0.0690752 0.2956289 0.0330928 -0.0770159 -0.0675171 -0.0646526 -0.1433766 -0.2456392 -0.2248444 0.0203637 0.0824508 0.0645157 0.0492238 0.0916146 0.2201971 0.1016015 0.0562798 0.1250724 0.1518123 0.0562198 -0.0424263 0.0255439 -0.0306402 0.037161 -0.0804177 0.0391224 -0.0977768 0.264664 0.4437207 -0.1541316 0.098584 -0.1290126 0.4976741 0.0390326 0.0726014 0.0456912 0.3270038 1.4511586 0.3607617 -0.4514354 0.3027869 0.6912084 0.3207233 -0.5488506 0.2614659 0.925248 0.0896145 0.0354478 0.0307703 0.0173743 0.0860195 -0.0219139 0.0213904 -0.0009727 -0.0489122 0.1058139 -0.0236536 -0.0251363 -0.0153115 0.0534541 -0.00505 0.0049348 -0.0215456 0.0912376 0.0480937 -0.000413 0.0029415 0.0309993 0.0168194 0.0070331 0.0042436 0.0390808 0.1259652 0.0636178 -0.0257247 -0.0572147 -0.0177753 0.1117258 0.0304174 -0.0146762 0.0320141 0.0471693 0.0011943 -0.0648388 0.0416273 -0.0269265 0.1288556 -0.0195333 0.0848329 0.0103194 0.0612858 0.0070119 0.1102751 -0.0230119 0.0490494 0.0476521 -0.0104778 -0.0450498 0.010036 0.1048092 0.1314911 -0.0145713 0.0020213 -0.0133028 0.0634223 0.087464 -0.0198875 0.0284469 -0.0092295 0.0300215 0.1029074 -0.0019226 0.0923675 0.0434068 0.0148926 0.0406877 -0.0420213 0.080088 -0.0391271 -0.0665608 0.041413 -0.0626763 0.1137223 0.0259339 -0.0103063 0.0066312 0.0874794 0.1662471 0.0034136 -0.0343093 0.0194889 0.0727559 -0.0647169 -0.0274783 -0.0142847 0.1024597 0.0319787 0.0277283 -0.0569213 0.0299781 0.0154562 0.0210535 -0.04606 0.0563968 -0.1542262 0.0149554 -0.0621248 -0.0196626 -0.0373928 -0.2097448 -0.0193788 -0.0213384 -0.055929 0.0338343 0.2308671 -0.0019857 0.1343268 -0.0279743 0.3571798 0.0676064 0.1364061 0.059393 0.2727064 0.4396876 -0.0064403 -0.0181182 -0.0019629 0.304143 -0.1231555 -0.0178119 -0.1229007 0.2931491 unknown
polarizability: 89.4470719|0.4835196|74.2486022|-6.0147935|3.1150174|70.0922002 unknown
InChI: InChI=1S/C6H14NO3/c1-7(2,3-4-8)5-6(9)10/h8-9H,3-5H2,1-2H3
charge 1 multiplicity 1
24 atoms
O  3.213932 -1.473088 0.142826
O  -3.099657 -0.831793 0.77742
O  -1.56382 -1.32037 -0.906925
N  0.216728 0.79616 0.153248
C  1.157252 -0.427785 0.292405
C  -1.139639 0.46075 0.788388
C  0.781691 1.988825 0.934313
C  0.041425 1.201647 -1.316947
C  2.537033 -0.288478 -0.378131
C  -1.917254 -0.665741 0.094033
H  1.310063 -0.593238 1.373139
H  0.633754 -1.292434 -0.140699
H  -1.761085 1.372829 0.782864
H  -0.967232 0.17724 1.840908
H  1.752002 2.274573 0.50611
H  0.081715 2.834893 0.854822
H  0.910719 1.701519 1.989012
H  -0.728704 1.986946 -1.375265
H  0.997199 1.597738 -1.688833
H  -0.266668 0.320218 -1.894867
H  2.452528 -0.31344 -1.483061
H  3.066568 0.638676 -0.074304
H  4.062646 -1.64072 -0.337587
H  -3.664094 -1.554527 0.38683
