program: Gaussian 09
title: 000168876
version: EM64L-G09RevD.01
frameworkgroup: C1[X(C13H14O9)]
method: RPBEPBE
basis: SDD
operation: Freq
keyword: #pfreq=noraman
keyword: PBEPBE/SDD
title: #p freq=noraman PBEPBE/SDD
converged: YES YES NO NO
title: Mulliken charges:
elementType: O O O O O O O O O C C C C C C C C C C C C C H H H H H H H H H H H H H H
charge: -0.229005 -0.461967 -0.468118 -0.291948 -0.445988 -0.478876 -0.159487 -0.205520 -0.385537 -0.151591 -0.159349 -0.087190 -0.091239 0.012588 0.147783 0.228391 0.103365 0.196652 -0.285116 -0.396026 -0.249398 -0.190613 0.229298 0.242644 0.238385 0.251093 0.238333 0.370636 0.382457 0.365908 0.400814 0.281827 0.220953 0.235125 0.232868 0.357846
chargesum: 0.00000
title: Mulliken charges with hydrogens summed into heavy atoms:
elementType: O O O O O O O O O C C C C C C C C C C C C C
charge: -0.229005 -0.091331 -0.085661 -0.291948 -0.080080 -0.078062 -0.159487 -0.205520 -0.027691 0.077707 0.083295 0.151195 0.159854 0.250921 0.147783 0.228391 0.103365 0.196652 -0.003289 -0.175073 -0.014273 0.042255
polarizability: 2.38666457e+02 -7.29221624e+00 1.40698006e+02 -1.10572406e+01 -1.48998871e+01 1.45558980e+02
1716.lowfreq: -9.2937 -6.0557 -0.0007 -0.0005 0.0006 0.9221 6.1668 24.2344 31.9435
frequency: -2.9447 24.1263 31.9223 44.9019 46.8836 76.0835 98.0725 119.3267 129.5313 159.4429 179.9244 215.7083 234.8251 250.4757 264.1031 277.6056 287.2290 317.5598 351.2750 383.3619 387.8930 399.4631 402.7242 413.8132 418.7395 435.8693 442.1965 484.9862 513.3044 517.8768 523.4262 536.7922 542.6983 559.1250 589.9134 609.6394 623.8275 653.0656 670.7494 686.0240 756.1775 761.4799 768.3945 817.6453 853.2308 868.6869 928.1058 946.0445 959.5439 964.8093 973.0748 992.1215 1007.7585 1023.1935 1036.8256 1043.0088 1049.9816 1057.5937 1072.1183 1085.3406 1092.5331 1101.5629 1161.6009 1176.1895 1179.5360 1216.9452 1218.5181 1226.0396 1230.7925 1252.7250 1256.2648 1273.8237 1297.0217 1299.6880 1304.2788 1306.0013 1335.0915 1350.7395 1381.4666 1396.1127 1400.7387 1402.2753 1431.0086 1490.5935 1595.5633 1610.3742 1659.8554 1709.5573 2930.7244 2958.2575 2986.1590 2990.5744 3004.9247 3114.5889 3145.0223 3166.1008 3194.2185 3483.8615 3522.6948 3542.6005 3550.2872 3559.4080
redmass: 5.5028 7.3950 9.3459 10.8562 7.8978 6.9696 7.7012 5.3481 6.7329 7.7976 6.8021 5.2455 4.7627 5.2564 5.2478 5.5974 7.2034 7.4727 6.3070 5.5750 6.6651 2.3820 1.2956 4.3313 1.4006 3.0862 1.2929 3.7632 2.2968 2.2158 3.1247 2.7052 4.9142 4.1379 2.2730 3.0741 3.0442 6.0977 4.4586 4.0766 2.3269 6.5385 1.8432 6.8216 1.5099 6.3879 6.6716 7.2531 1.3642 6.9271 6.3025 1.3482 4.7598 4.6397 4.2595 2.2701 3.9356 2.8978 2.8819 3.0586 2.0140 2.9850 1.2297 1.0643 1.3287 1.3042 1.9251 1.4507 1.3362 1.2446 2.8347 1.3958 1.3766 1.3529 1.1963 1.2136 1.2752 1.3322 1.8154 4.8745 1.7176 1.6177 2.3735 2.5303 6.4200 6.5353 11.9605 9.8617 1.0803 1.0818 1.0840 1.0848 1.0854 1.0888 1.0903 1.0960 1.0957 1.0652 1.0643 1.0656 1.0658 1.0656
irintensity: 0.0516 3.2706 3.5081 1.4884 0.6627 3.8725 2.4442 0.3584 0.0503 3.0304 2.0951 5.1046 0.8970 1.2188 13.0976 9.7505 1.5589 3.3460 1.8256 12.1473 5.8998 44.1193 113.7132 21.1526 77.0134 3.5493 192.0135 6.5735 52.8449 49.1114 24.9973 36.0332 19.2398 59.8872 121.2167 49.5845 63.4603 7.8553 23.2143 18.6518 56.4088 30.9194 38.0045 76.5990 0.2836 11.5331 189.9150 77.0824 3.0643 163.2456 765.8766 0.3833 186.3520 45.9913 35.9284 3.8445 5.3220 59.8885 12.1495 24.8378 103.6326 227.2887 42.4655 15.8842 13.8738 17.3240 134.3161 155.0245 11.6917 12.4186 13.2251 13.6002 36.7392 57.8571 36.8918 11.2557 41.5958 8.9758 7.1288 14.5390 26.5299 10.4785 30.4510 23.4754 42.1774 47.3551 253.7402 217.5849 17.3562 13.4779 9.8398 16.5654 76.9481 12.1155 11.6457 17.7033 5.3635 97.4307 33.2236 20.6223 31.7004 27.6031
temp: 298.150 k
press: 1.00000 atm
elementType: 8 8 8 8 8 8 8 8 8 6 6 6 6 6 6 6 6 6 6 6 6 6 1 1 1 1 1 1 1 1 1 1 1 1 1 1
symmnumber: 1
zpe: 690101.4 jmol-1
zpe.correction: 0.262846 hartree
zpe.thermalcorrener: 0.282872 hartree
zpe.thermalcorrenthalpy: 0.283816 hartree
zpe.thermalcorrgfe: 0.213287 hartree
zpe.sumelectzpe: -1179.116862 hartree
zpe.sumelectthermal: -1179.096836 hartree
zpe.sumelectthermalent: -1179.095892 hartree
zpe.sumelectthermalfe: -1179.166421 hartree
dipole: -0.3532 -0.9668 -1.2643
dipole: 1.6303
quadrupole: -72.7498 -128.7176 -126.2725
quadrupole: 5.3510 1.0685 -4.0322
quadrupole: 36.4968 -19.4709 -17.0259 5.3510 1.0685 -4.0322
hfenergy: -1179.3797077 hartree
pointgroup: C01 [X(C13H14O9)]
dipole: 0.1300807 -0.2669709 0.5685004 debye
polarizability: 238.9776137|6.9716077|147.187584|-9.8543656|14.4940588|138.7582458 unknown
InChI: InChI=1S/C13H14O9/c14-6-4-2-1-3-5(6)12(20)22-13-9(17)7(15)8(16)10(21-13)11(18)19/h1-4,7-10,13-18H
charge 0 multiplicity 1
36 atoms
O  1.33217 -0.539519 0.394175
O  3.581395 2.921044 -0.272181
O  4.942285 0.398858 -0.231122
O  -0.636336 0.604985 -0.047792
O  0.877539 2.80341 -1.192055
O  4.600095 -2.082173 0.841936
O  2.493338 -2.753613 1.5669
O  -1.257232 -0.912956 -1.724823
O  -3.947332 -1.481611 -1.837599
C  2.941339 1.634846 -0.556388
C  3.572055 0.501978 0.266524
C  1.444548 1.83058 -0.264573
C  2.727542 -0.793769 0.040583
C  0.725325 0.493173 -0.48204
C  3.181865 -1.971472 0.900706
C  -1.594313 -0.211413 -0.752322
C  -2.937731 -0.051109 -0.145134
C  -4.089622 -0.69528 -0.695225
C  -3.108387 0.75331 1.017312
C  -5.358442 -0.527587 -0.083105
C  -4.366759 0.918473 1.62251
C  -5.496997 0.272253 1.066573
H  3.068842 1.378779 -1.632149
H  3.551081 0.758969 1.346659
H  1.315114 2.1514 0.789823
H  2.832357 -1.089912 -1.029613
H  0.771719 0.161584 -1.540136
H  4.554239 2.813698 -0.43189
H  5.354484 -0.413688 0.169817
H  1.458575 3.607667 -1.158293
H  4.893496 -2.866135 1.379927
H  -2.224005 1.242439 1.430698
H  -6.235726 -1.027565 -0.514449
H  -4.469205 1.541241 2.516189
H  -6.48408 0.390506 1.526622
H  -4.822436 -1.86269 -2.105563
