program: Gaussian 09
title: 000168725
version: EM64L-G09RevD.01
frameworkgroup: C1[X(C2H5O3P)]
method: RPBEPBE
basis: SDD
operation: Freq
keyword: #pfreq=noraman
keyword: PBEPBE/SDD
title: #p freq=noraman PBEPBE/SDD
converged: NO YES NO NO
title: Mulliken charges:
elementType: P O O O C C H H H H H
charge: 1.251149 -0.672619 -0.669760 -0.627173 -0.420661 -0.421609 0.274864 0.394868 0.388325 0.237879 0.264738
chargesum: 0.00000
title: Mulliken charges with hydrogens summed into heavy atoms:
elementType: P O O O C C
charge: 1.251149 -0.277752 -0.281436 -0.627173 -0.145797 0.081008
polarizability: 6.65334241e+01 -2.93213624e+00 5.11660961e+01 1.67545988e+00 -3.56080866e+00 3.97408985e+01
1716.lowfreq: -12.6770 -0.0040 -0.0036 -0.0025 6.0237 13.1804 94.5860 102.4107 182.4984
frequency: 94.5428 102.4061 182.4973 207.5024 277.9335 314.7023 320.8609 357.6519 430.8935 604.0541 631.7205 710.7504 735.1631 982.0452 991.2455 998.8570 1014.1928 1018.8064 1085.8565 1248.7391 1407.8151 1623.0863 3099.3861 3168.8146 3212.2131 3583.3100 3604.0131
redmass: 2.5019 2.7695 3.3764 2.2517 1.3047 2.8823 3.5415 2.6910 4.8006 1.7885 5.0017 5.8150 7.3698 1.8240 1.1178 1.2008 1.2679 1.3082 2.7760 1.2999 1.1892 4.3396 1.0605 1.0966 1.1154 1.0661 1.0662
irintensity: 1.8542 59.1654 17.5452 40.7881 91.8198 64.1222 11.7556 106.1211 11.2231 0.8436 14.0873 206.3356 283.7758 14.7797 34.5511 27.0682 78.7948 44.2259 130.4278 2.0881 26.8876 0.2335 2.4543 1.1876 3.3610 59.5380 53.1858
temp: 298.150 k
press: 1.00000 atm
elementType: 15 8 8 8 6 6 1 1 1 1 1
symmnumber: 1
zpe: 191456.7 jmol-1
zpe.correction: 0.072922 hartree
zpe.thermalcorrener: 0.080989 hartree
zpe.thermalcorrenthalpy: 0.081933 hartree
zpe.thermalcorrgfe: 0.040719 hartree
zpe.sumelectzpe: -645.590631 hartree
zpe.sumelectthermal: -645.582564 hartree
zpe.sumelectthermalent: -645.581620 hartree
zpe.sumelectthermalfe: -645.622834 hartree
dipole: -0.6073 -0.6620 1.3447
dipole: 1.6171
quadrupole: -31.3597 -47.7460 -45.2717
quadrupole: 1.1107 -1.9311 4.3800
quadrupole: 10.0994 -6.2869 -3.8126 1.1107 -1.9311 4.3800
hfenergy: -645.6635528 hartree
pointgroup: C01 [X(C2H5O3P1)]
dipole: 0.2550194 0.4257397 0.3981274 debye
dipolederiv: 1.9927189 -0.2578738 -0.010889 -0.0844758 1.4436572 0.0033997 0.075252 -0.0831798 1.9440779 -0.5803667 0.2075738 -0.1645194 0.1916702 -0.7554468 0.191749 -0.2360766 0.1728838 -1.0029805 -0.945142 0.1946421 0.1694933 0.1654601 -0.4989265 -0.2407602 0.1732681 -0.1948691 -0.9046326 -0.7335225 -0.0370932 -0.0061259 -0.0000652 -0.6980425 -0.0281587 -0.0002111 0.0140099 -0.6504095 -0.2651302 0.1229217 0.0114769 -0.0091813 -0.1486814 -0.0041902 0.0435484 -0.0124593 -0.390538 -0.0169013 0.0621562 0.0526163 -0.0704144 0.0606897 -0.0284926 0.0477907 0.009542 -0.2668866 -0.0032955 -0.0389412 -0.0365005 -0.0451076 -0.0015837 0.0015424 -0.0330122 0.0022501 0.1977399 0.1312226 -0.087031 0.0037868 -0.0604048 0.3511283 0.0468229 -0.0255833 0.0138623 0.380383 0.3486561 -0.0654014 0.035417 -0.0389797 0.1556738 0.0551534 0.015579 0.0855859 0.3204251 -0.0550161 -0.049078 -0.0474258 -0.0288952 0.0934224 -0.0007499 -0.058465 -0.004078 0.1935872 0.1267766 -0.0518754 -0.0073297 -0.0196062 -0.0018906 0.0036843 -0.00209 -0.0035479 0.179234 unknown
polarizability: 64.4748989|-5.1940532|53.242073|3.566427|-3.3981237|39.7234468 unknown
InChI: InChI=1S/C2H5O3P/c1-2-6(3,4)5/h2-4H,1H2
charge 0 multiplicity 1
11 atoms
P  -0.384631 0.079303 -0.233389
O  -0.738924 0.983508 -1.656697
O  -1.356562 0.936614 0.939006
O  -0.665278 -1.489605 -0.241038
C  1.333583 0.63501 0.05393
C  2.312913 -0.268229 0.286799
H  1.496773 1.716971 0.031912
H  -1.669214 0.909604 -1.987781
H  -1.852906 0.324161 1.541343
H  3.34419 0.053652 0.468778
H  2.108057 -1.345489 0.294737
