program: Gaussian 09
title: 000168712
version: EM64L-G09RevD.01
frameworkgroup: C1[X(C4H8O3)]
method: RPBEPBE
basis: SDD
operation: Freq
keyword: #p
keyword: freq=noraman
keyword: PBEPBE/SDD
title: #p freq=noraman PBEPBE/SDD
converged: YES YES NO NO
title: Mulliken charges:
elementType: O O O C C C C H H H H H H H H
charge: -0.286912 -0.440738 -0.454490 -0.246523 -0.334109 0.420334 -0.714873 0.215697 0.232851 0.206378 0.236352 0.338510 0.240326 0.214535 0.372664
chargesum: 0.00000
title: Mulliken charges with hydrogens summed into heavy atoms:
elementType: O O O C C C C
charge: -0.286912 -0.102229 -0.081826 0.202024 0.108620 0.420334 -0.260012
polarizability: 7.88435967e+01 -8.92597257e+00 5.47321752e+01 -2.62287757e+00 1.91601289e+00 3.55194081e+01
1716.lowfreq: -31.6906 -7.1420 -5.5876 -0.0008 -0.0007 0.0011 30.8963 52.8342 117.2437
frequency: 17.8947 52.5885 117.2309 136.5852 304.2105 310.8477 335.0554 343.0638 474.2055 550.7443 607.2469 638.2633 786.1372 810.5963 826.8564 902.4698 970.3745 1025.7426 1053.4626 1075.7603 1105.7178 1149.4741 1262.1027 1297.5682 1314.9651 1350.4447 1386.0981 1416.3859 1470.8990 1483.7410 1663.5198 2990.0523 2998.7908 3065.6631 3109.0631 3140.3594 3257.9065 3564.1550 3604.7154
redmass: 1.9924 5.0834 3.3213 4.3750 1.6210 2.0162 1.3766 2.1936 2.8919 4.8958 5.4283 1.1039 1.3338 1.0967 7.2275 2.3632 4.2699 3.5491 1.5447 2.3057 1.8000 1.1660 1.1925 1.3255 1.8412 1.3167 1.3095 1.2184 1.0759 1.0849 6.6698 1.0671 1.0575 1.1055 1.1007 1.0629 1.1147 1.0664 1.0658
irintensity: 6.1605 4.4962 16.8234 6.5480 43.2255 119.5891 139.8324 28.9822 13.7191 3.5521 3.1061 25.6284 148.4617 5.3265 2.5090 43.3187 76.1143 165.0807 1.3453 96.2790 165.9082 13.8771 5.1349 17.1670 127.1346 23.6233 1.9145 6.7211 1.6247 8.3324 360.1811 30.5244 54.2283 21.9261 35.6938 3.3613 6.0974 8.6110 26.8628
temp: 298.150 k
press: 1.00000 atm
elementType: 8 8 8 6 6 6 6 1 1 1 1 1 1 1 1
symmnumber: 1
zpe: 310855.4 jmol-1
zpe.correction: 0.118399 hartree
zpe.thermalcorrener: 0.127163 hartree
zpe.thermalcorrenthalpy: 0.128107 hartree
zpe.thermalcorrgfe: 0.083413 hartree
zpe.sumelectzpe: -382.260135 hartree
zpe.sumelectthermal: -382.251371 hartree
zpe.sumelectthermalent: -382.250426 hartree
zpe.sumelectthermalfe: -382.295120 hartree
dipole: 1.5384 1.8863 0.7743
dipole: 2.5543
quadrupole: -40.4971 -39.9533 -43.6375
quadrupole: 1.9295 -6.4992 1.0890
quadrupole: 0.8656 1.4093 -2.2749 1.9295 -6.4992 1.0890
hfenergy: -382.3785336 hartree
pointgroup: C01 [X(C4H8O3)]
dipole: -0.6015472 -0.7034361 0.3914227 debye
dipolederiv: -1.79118 0.2005051 -0.0749746 -0.1601866 -0.3675842 0.0184457 -0.1426774 0.079602 -0.3178118 -0.9088202 0.0753109 -0.0893735 0.0725937 -0.5169339 -0.1962805 -0.0968114 -0.1647793 -0.2126195 -0.3126121 -0.0725905 0.0609061 -0.00753 -1.2031461 0.1208378 -0.0020123 0.1442373 -0.4233568 0.822264 -0.1795051 -0.0314256 -0.4131239 0.292298 -0.02476 -0.0013524 -0.0555449 0.385498 0.6083804 -0.1428433 0.0189818 -0.0806198 0.3906997 0.0616997 0.0623338 0.0404499 0.2957584 1.8016605 -0.1962927 0.1683368 0.2404204 1.236669 -0.1901238 0.2535111 -0.2250593 0.2371539 -0.6604924 0.3248756 -0.0492261 0.2451739 -0.3527444 -0.0345382 -0.0623803 -0.0421011 -0.6393163 -0.016573 0.0302766 0.0003968 0.0861998 -0.0511062 0.0884342 -0.0221681 0.1235456 -0.0471003 -0.0364203 0.0140027 -0.0315816 0.0644119 0.0008391 -0.0753088 0.0158982 -0.1060029 -0.0954502 -0.0051376 0.037581 0.0028575 0.0125068 -0.0196844 -0.1013353 0.0000991 -0.1492564 -0.1220154 0.0477245 0.0167883 0.0091538 0.0097844 -0.0196171 0.085431 0.0026399 0.1177392 -0.0174197 0.3656308 0.0067486 0.0782413 0.0473766 0.2340833 0.162529 0.0562817 0.1625032 0.0902898 0.098428 -0.0279599 -0.0047797 -0.0387666 -0.027984 0.0456293 -0.0085583 0.0454464 0.241007 -0.0562576 -0.074677 -0.0024273 -0.0868469 0.0391271 0.0301614 0.0098046 0.031848 0.2355814 0.043405 -0.0122202 -0.0550859 0.0086062 0.3650842 0.0091784 -0.0646081 -0.0026279 0.3898016 unknown
polarizability: 78.9144299|-8.5734053|54.033931|3.302491|-3.9644872|36.1468189 unknown
InChI: InChI=1S/C4H8O3/c1-4(6)7-3-2-5/h5-6H,1-3H2
charge 0 multiplicity 1
15 atoms
O  -0.333136 0.569755 0.194063
O  3.285193 -0.231719 -0.129133
O  -1.620461 -1.353242 0.285856
C  0.824769 -0.337573 -0.006906
C  2.064591 0.563162 0.068943
C  -1.607277 0.042138 0.086028
C  -2.698227 0.818626 -0.143719
H  0.831729 -1.111268 0.78395
H  0.758239 -0.834144 -0.992126
H  2.076432 1.11242 1.031941
H  2.060014 1.29438 -0.753508
H  3.42104 -0.825163 0.652277
H  -2.577318 1.887601 -0.317512
H  -3.708626 0.402796 -0.132605
H  -2.534262 -1.705567 0.153452
