program: Gaussian 09
title: 000168723
version: EM64L-G09RevD.01
frameworkgroup: C1[X(C15H20O4)]
method: RPBEPBE
basis: SDD
operation: Freq
keyword: #pfreq=noraman
keyword: PBEPBE/SDD
title: #p freq=noraman PBEPBE/SDD
converged: YES YES NO NO
title: Mulliken charges:
elementType: O O O O C C C C C C C C C C C C C C C H H H H H H H H H H H H H H H H H H H H
charge: -0.242933 -0.468857 -0.489096 -0.194444 0.403862 -0.260713 -0.183940 -0.504550 -0.142438 -0.193661 -0.482248 0.491344 -0.510102 -0.822116 -0.301259 0.284040 0.065682 -0.761838 -0.696509 0.260204 0.259539 0.202377 0.264313 0.250958 0.228783 0.210010 0.216365 0.257724 0.229680 0.226845 0.222835 0.241600 0.228842 0.375509 0.219257 0.262975 0.363117 0.229994 0.258849
chargesum: 0.00000
title: Mulliken charges with hydrogens summed into heavy atoms:
elementType: O O O O C C C C C C C C C C C C C C C
charge: -0.242933 -0.093348 -0.125979 -0.194444 0.403862 -0.000509 0.075598 -0.037860 0.108520 0.035122 -0.055874 0.491344 -0.022698 -0.130835 -0.072417 0.284040 0.065682 -0.279607 -0.207666
polarizability: 2.01480672e+02 1.67921137e+00 1.72580046e+02 1.26115044e+00 5.55370370e+00 1.26221883e+02
1716.lowfreq: -0.0007 -0.0006 -0.0005 5.0168 6.7905 17.8582 59.7381 66.8792 95.5148
frequency: 59.7137 66.8634 95.4854 128.1061 140.6876 173.8415 187.3357 209.5585 212.4387 242.3303 245.8483 250.8899 292.5865 299.7582 307.4976 330.6264 379.0576 383.3032 398.6365 413.7883 441.4516 449.6460 460.4040 494.8415 496.8941 542.5303 573.6374 602.0501 615.4087 635.2082 642.0584 667.1770 704.7031 743.7826 773.9209 788.7813 791.1782 833.8153 842.3480 850.5715 867.3832 878.2668 906.9700 918.3728 933.6094 940.2802 956.7045 979.1752 982.6239 997.9895 1003.3798 1026.5280 1038.0583 1046.6000 1062.6208 1101.5410 1122.3733 1128.1809 1151.2282 1162.0865 1170.1508 1183.9691 1195.1616 1218.4372 1237.4766 1242.6179 1260.6128 1261.8362 1274.3097 1295.9683 1302.3036 1319.9039 1325.5621 1330.8625 1337.6751 1346.5074 1353.2396 1354.7204 1394.6787 1399.3291 1420.7338 1431.3023 1442.5573 1447.7193 1467.0358 1474.3858 1482.2092 1498.9871 1660.4963 1682.6914 1692.8291 2926.7708 2956.5463 2975.8895 2978.9007 2987.2762 2993.9190 2996.6747 2998.3395 3020.3044 3036.2461 3051.4046 3062.8422 3070.7041 3079.6199 3089.9530 3097.1295 3202.4856 3206.1978 3357.8505 3563.3194
redmass: 5.2056 4.7736 4.4798 4.9008 5.5213 4.0116 2.9905 1.7976 2.5945 3.4828 3.5989 2.7293 3.6034 3.9244 3.5055 2.4687 2.7123 3.2938 1.2530 3.4781 3.1187 2.7734 2.7982 2.8347 4.1558 3.6132 4.9963 2.5928 1.5483 3.6449 2.1409 2.5186 1.9928 1.7027 3.8244 2.2650 2.8662 2.2522 3.4478 2.3925 3.3347 2.0405 4.0025 2.2570 2.5288 1.9383 1.3675 1.5038 1.8603 2.4178 2.0589 2.1806 3.3303 2.0207 1.9237 2.5907 2.2236 1.9817 1.7199 1.7512 1.4614 1.7460 1.2522 1.4404 1.9269 1.4679 1.7177 1.5865 1.7650 1.2305 1.3299 1.3573 1.3974 1.4091 1.4480 1.5779 1.6392 1.6314 1.4073 1.3935 1.1784 1.1943 1.1894 1.0851 1.0764 1.0870 1.0613 1.0550 5.4539 7.3587 10.7872 1.0803 1.0795 1.0403 1.0578 1.0631 1.0826 1.0845 1.0833 1.0682 1.1004 1.1018 1.0972 1.1014 1.0988 1.0643 1.0616 1.1124 1.1155 1.0672 1.0663
irintensity: 1.5791 4.7511 0.8545 1.5778 3.9630 1.6245 0.5852 0.6714 2.9685 0.5667 1.8216 0.2485 14.1893 6.9242 6.5430 4.0664 12.8564 5.6909 106.4271 8.2740 19.0551 6.5675 3.1421 6.1949 4.5889 0.8673 0.4729 21.1894 124.8075 5.0603 47.5387 7.5799 10.2574 6.5693 13.5798 6.5442 5.2306 34.6676 16.3187 9.1943 9.2799 15.0895 38.9082 62.8277 45.6513 8.9488 59.6392 27.9868 42.0795 97.5904 12.2478 43.6021 110.0175 57.4374 4.2652 4.0085 14.3591 10.6453 17.9344 28.3983 27.9513 17.6917 10.4493 3.3074 40.8741 6.1411 10.8359 18.8882 2.3510 2.0604 1.8841 5.7240 1.7554 3.3740 1.9339 9.3425 3.0975 11.4985 11.7372 24.2558 25.5969 92.1033 7.9247 26.3200 5.9851 3.4896 13.9472 3.5698 12.6934 53.8969 250.8796 5.2634 3.1156 16.7187 13.4113 32.5885 24.0461 34.9887 65.5866 56.8066 23.2574 41.7918 34.8641 20.9936 20.6695 12.1092 4.4857 9.7242 3.3998 155.2408 8.9818
temp: 298.150 k
press: 1.00000 atm
elementType: 8 8 8 8 6 6 6 6 6 6 6 6 6 6 6 6 6 6 6 1 1 1 1 1 1 1 1 1 1 1 1 1 1 1 1 1 1 1 1
symmnumber: 1
zpe: 850134.4 jmol-1
zpe.correction: 0.323799 hartree
zpe.thermalcorrener: 0.341016 hartree
zpe.thermalcorrenthalpy: 0.341960 hartree
zpe.thermalcorrgfe: 0.280911 hartree
zpe.sumelectzpe: -883.006270 hartree
zpe.sumelectthermal: -882.989053 hartree
zpe.sumelectthermalent: -882.988109 hartree
zpe.sumelectthermalfe: -883.049158 hartree
dipole: 2.3059 -2.0949 2.5306
dipole: 4.0137
quadrupole: -123.5306 -114.7421 -114.4163
quadrupole: 22.1848 5.1466 -3.1899
quadrupole: -5.9676 2.8209 3.1467 22.1848 5.1466 -3.1899
hfenergy: -883.3300688 hartree
pointgroup: C01 [X(C15H20O4)]
dipole: -0.9378099 0.8249485 0.966186 debye
polarizability: 201.4593084|2.1047516|172.4975673|0.4710602|-6.0020259|126.3257249 unknown
InChI: InChI=1S/C15H20O4/c1-7-9-4-5-15(3)11(17)6-10(16)8(2)12(15)13(9)19-14(7)18/h9-13,16-17H,1-2,4-6H2,3H3
charge 0 multiplicity 1
39 atoms
O  1.746595 -1.485676 0.009057
O  -2.555749 1.17756 -1.67278
O  -2.913466 -1.52794 -1.471459
O  4.036891 -1.894701 -0.237446
C  -1.151257 1.112417 0.407894
C  -0.514376 -0.278174 -0.036106
C  0.95069 -0.258516 0.379891
C  -0.328901 2.310014 -0.165584
C  1.71187 0.885871 -0.328069
C  -2.597516 1.16533 -0.201927
C  1.193572 2.252273 0.139012
C  -1.367012 -1.439001 0.461187
C  -3.477565 -0.000583 0.303043
C  -1.249885 1.241755 1.953952
C  -2.824963 -1.368205 0.020571
C  3.146809 0.435799 -0.156362
C  3.109862 -1.074292 -0.135108
C  -0.925759 -2.4820 1.211576
C  4.295929 1.144828 -0.052659
H  -0.55309 -0.277189 -1.146825
H  1.044188 -0.165083 1.480063
H  -0.755329 3.249241 0.239604
H  -0.485805 2.334211 -1.260721
H  1.474273 0.790438 -1.41219
H  -3.052904 2.132244 0.088681
H  1.707805 3.073518 -0.395435
H  1.400908 2.392677 1.218158
H  -4.460187 0.036292 -0.202129
H  -3.657683 0.093953 1.388714
H  -0.282011 1.519933 2.406597
H  -1.971051 2.037826 2.221443
H  -1.580671 0.304377 2.434582
H  -3.406922 -2.181777 0.49656
H  -2.696889 0.234865 -1.979725
H  -1.61143 -3.278032 1.530361
H  0.123481 -2.588334 1.502108
H  -2.423116 -2.345988 -1.739235
H  4.303416 2.24017 -0.075581
H  5.255646 0.6272 0.057885
