program: Gaussian 09
title: 000168705
version: EM64L-G09RevD.01
frameworkgroup: C1[X(C9H11NO3)]
method: RPBEPBE
basis: SDD
operation: Freq
keyword: #p
keyword: freq=noraman
keyword: PBEPBE/SDD
title: #p freq=noraman PBEPBE/SDD
converged: YES YES NO NO
title: Mulliken charges:
elementType: O O O N C C C C C C C C C H H H H H H H H H H H
charge: -0.282868 -0.300179 -0.277855 -0.690911 0.110820 0.253752 0.552125 -0.564739 -0.289891 -0.449151 0.182367 -0.527491 -0.498976 0.246912 0.270523 0.221386 0.311328 0.312686 0.283451 0.210588 0.224215 0.239450 0.227035 0.235425
chargesum: 0.00000
title: Mulliken charges with hydrogens summed into heavy atoms:
elementType: O O O N C C C C C C C C C
charge: -0.282868 -0.300179 -0.277855 -0.066897 0.110820 0.253752 0.552125 -0.317827 -0.019369 -0.227766 0.182367 0.190764 0.202934
polarizability: 1.86824061e+02 8.59092536e+00 1.28743959e+02 7.59104926e-01 -4.61123771e+00 6.01230285e+01
1716.lowfreq: -9.2044 -5.6010 0.0009 0.0011 0.0011 5.6025 49.6532 72.6629 102.0651
frequency: 49.6308 72.6515 102.0528 104.6608 124.7785 147.5186 161.7462 215.5316 253.3074 278.5477 296.2529 328.4826 347.0675 404.5016 412.0598 419.6074 461.3572 471.1988 584.2283 598.5419 644.4803 678.4270 713.7672 746.2816 757.1551 814.3826 865.8475 889.7574 919.2555 968.0042 994.7832 1030.2110 1056.8633 1111.0697 1112.0834 1130.8804 1142.5208 1156.9394 1193.0723 1241.3006 1254.2867 1333.3304 1388.0537 1418.9183 1428.8112 1446.7954 1449.5321 1455.5242 1466.2814 1479.8140 1505.4659 1552.4028 1611.6992 1635.9743 1646.8362 2980.6466 2998.1181 3091.8592 3096.7360 3123.4639 3134.0216 3138.9133 3151.8746 3179.4633 3563.0239 3703.5877
redmass: 4.2350 3.6330 1.3413 2.3051 1.3159 3.0190 4.2193 3.5892 3.6157 5.4775 4.9522 3.9453 3.5595 1.1562 3.3637 1.3372 3.0146 4.8050 5.2597 5.9998 4.8293 3.6689 6.4221 5.1778 3.5946 1.6189 1.8178 5.6367 7.7506 1.3480 2.7573 3.7573 1.9108 1.2632 1.2608 1.6023 1.4441 1.3494 2.1178 3.4409 1.6751 2.3195 3.1447 1.3436 1.8003 1.1440 1.0519 1.8678 1.0545 1.0644 3.6040 7.1045 8.0968 2.5554 1.6643 1.0323 1.0295 1.0997 1.1041 1.1051 1.0898 1.1043 1.0915 1.0942 1.0450 1.1041
irintensity: 2.1567 4.2094 1.0180 7.4702 0.6342 4.5916 3.5286 1.8653 4.8336 9.4481 6.9075 8.4115 3.5269 179.7422 30.0508 104.9809 1.0394 1.6825 15.7068 10.3353 3.3058 21.5406 1.8811 6.3199 18.3408 29.2165 55.7871 10.4340 7.1465 0.8266 22.2722 141.0218 109.2839 6.7686 1.2041 98.0581 74.4747 43.8393 87.1364 219.8762 102.3784 38.6708 59.8487 35.1660 17.7121 34.2458 12.7171 16.5395 12.8698 45.3542 59.2231 97.3239 320.4451 155.4348 452.4653 63.1453 53.8764 41.5402 31.6297 8.8340 14.2991 20.0777 7.7153 4.8882 106.0342 23.7379
temp: 298.150 k
press: 1.00000 atm
elementType: 8 8 8 7 6 6 6 6 6 6 6 6 6 1 1 1 1 1 1 1 1 1 1 1
symmnumber: 1
zpe: 491881.9 jmol-1
zpe.correction: 0.187348 hartree
zpe.thermalcorrener: 0.200755 hartree
zpe.thermalcorrenthalpy: 0.201699 hartree
zpe.thermalcorrgfe: 0.147405 hartree
zpe.sumelectzpe: -628.999349 hartree
zpe.sumelectthermal: -628.985942 hartree
zpe.sumelectthermalent: -628.984998 hartree
zpe.sumelectthermalfe: -629.039291 hartree
dipole: -2.7625 -1.8012 1.5541
dipole: 3.6457
quadrupole: -50.1491 -69.7713 -80.8107
quadrupole: 0.2589 3.0778 4.2826
quadrupole: 16.7613 -2.8610 -13.9003 0.2589 3.0778 4.2826
hfenergy: -629.1866969 hartree
pointgroup: C01 [X(C9H11N1O3)]
dipole: -1.0970628 0.7472872 -0.5434379 debye
dipolederiv: -0.5486167 0.5204841 0.0921557 0.4237661 -1.3140998 -0.1878242 0.0413287 0.0198319 -0.3384931 -1.2875409 -0.3953431 0.1038064 -0.8327847 -0.8340438 0.1846741 0.2948768 0.2247922 -0.3714029 -1.0110921 0.2500246 -0.123449 0.2822506 -0.7763427 0.1596243 -0.1430172 0.1862857 -0.4281616 -1.7581246 0.2929792 0.0716014 0.2124935 -0.1837882 -0.1081655 0.0823136 -0.097303 -0.7190895 -1.2662707 -0.0905626 0.024976 0.1508206 -0.4498191 0.0064076 0.017423 0.0819594 -0.1289183 0.8836734 -0.2836189 -0.0217535 -0.1462924 1.2831519 0.1355169 -0.0915366 -0.0915872 0.0959122 1.8506127 -0.3047305 -0.1455074 -0.2286803 0.3956548 0.0353091 -0.1918832 0.0227249 0.1861033 -0.6628023 0.3410437 0.0419769 0.5750054 -0.3249023 -0.0920851 0.004001 -0.0972611 -0.2660555 0.5395595 -0.1511099 -0.0312423 -0.4066678 0.1452137 -0.0134984 0.0571434 -0.0124314 -0.0659493 -0.7445996 0.0236593 0.0179367 -0.3631028 -0.0102262 -0.01266 0.0876611 -0.0357925 -0.2617682 2.308788 0.1054674 0.0121834 0.4278127 1.1686243 -0.4003856 -0.1380194 -0.424066 0.4152106 0.4177992 -0.4053365 -0.145568 -0.1323584 0.4403613 0.1000801 -0.1251994 0.2266271 0.3435693 0.7725865 0.1854605 -0.0373605 0.1091499 0.2776767 0.0085477 -0.017399 0.0146382 0.2721519 -0.005684 -0.0796813 0.0172985 -0.0781233 -0.0030639 0.0189391 0.0384533 -0.0039539 0.1758389 0.1034588 -0.0681019 0.0108861 -0.0645804 0.0100384 0.0151489 0.0106602 0.0182354 0.1424619 0.0054657 0.0945444 0.0045925 0.0874205 -0.0867331 0.0211862 0.0041425 0.0175957 0.1722312 0.2256312 -0.0228823 0.0237736 -0.0703293 0.1421984 0.0385249 0.026552 0.0385384 0.3770843 0.2401284 -0.0064521 0.0170829 0.0504048 0.1136117 0.0317322 0.0144379 0.034699 0.3775966 -0.0594352 0.0979501 -0.0114427 -0.0187924 0.1768014 -0.0007427 -0.038523 -0.0031974 0.055462 0.0274861 0.0740581 0.0232987 0.0054581 0.0142327 0.1362787 0.0538304 -0.0008819 -0.1174941 0.0584966 -0.0767659 0.0058381 -0.0064943 -0.1892779 -0.0707701 0.0303615 -0.0964793 0.088898 -0.0500465 -0.0464708 -0.0098037 0.0293981 0.1000501 0.0296007 -0.1004118 -0.0194646 -0.1124989 0.0291935 -0.0444965 0.0130879 -0.1209288 -0.0852593 0.0751893 0.040359 0.0784351 0.0878487 -0.0686669 -0.0101193 0.0456323 0.1151546 -0.010059 -0.1106283 0.0424454 -0.0819449 0.0194625 unknown
polarizability: 185.7643385|-10.4875568|129.3978418|-7.9750097|-3.2549073|60.5288687 unknown
InChI: InChI=1S/C9H11NO3/c1-12-8-5-6(10)3-4-7(8)9(11)13-2/h3-5H,10H2,1-2H3
charge 0 multiplicity 1
24 atoms
O  -0.354099 -2.297663 0.0711
O  2.302237 1.254021 -0.507124
O  2.351257 -0.870386 0.435496
N  -4.013418 0.769896 0.197064
C  0.200602 0.169217 -0.153957
C  -0.695645 -0.94425 0.010385
C  -2.643487 0.57349 0.067214
C  -2.08602 -0.727677 0.132927
C  -0.394126 1.465878 -0.269569
C  -1.768928 1.681778 -0.164605
C  1.669803 0.076248 -0.044038
C  0.712415 -2.853323 -0.783627
C  3.769069 1.28108 -0.333982
H  -2.722717 -1.611028 0.248465
H  0.278864 2.315034 -0.412869
H  -2.176315 2.696383 -0.240478
H  -4.414288 1.700115 0.119767
H  -4.638265 -0.010352 0.378763
H  1.682155 -2.79326 -0.267667
H  0.767767 -2.309342 -1.745614
H  0.413823 -3.89934 -0.959029
H  4.03736 1.163275 0.729922
H  4.077758 2.265636 -0.714339
H  4.241996 0.468369 -0.911504
