program: Gaussian 09
title: 000168703
version: EM64L-G09RevD.01
frameworkgroup: C1[X(C14H16O3S)]
method: RPBEPBE
basis: SDD
operation: Freq
keyword: #p
keyword: freq=noraman
keyword: PBEPBE/SDD
title: #p freq=noraman PBEPBE/SDD
converged: YES YES NO NO
title: Mulliken charges:
elementType: S O O O C C C C C C C C C C C C C C H H H H H H H H H H H H H H H H
charge: 0.924579 -0.560433 -0.506649 -0.500085 -0.592859 0.570526 -0.438949 -0.351952 0.430354 0.393162 -0.345362 -0.428123 -0.466214 -0.330578 -0.420715 -0.699141 -0.255491 -0.244187 0.210638 0.275411 0.197831 0.229482 0.189269 0.217710 0.247777 0.244362 0.275449 0.245962 0.207933 0.216655 0.217547 0.234819 0.235750 0.375523
chargesum: 0.00000
title: Mulliken charges with hydrogens summed into heavy atoms:
elementType: S O O O C C C C C C C C C C C C C C
charge: 0.924579 -0.184910 -0.506649 -0.500085 -0.106810 0.570526 -0.438949 0.075361 0.430354 0.393162 0.061617 -0.180347 -0.221852 -0.055128 -0.174753 -0.057006 -0.020672 -0.008437
polarizability: 2.67062418e+02 -5.60704702e-01 1.97211388e+02 -2.16550428e+01 9.33594372e+00 1.17014706e+02
1716.lowfreq: -8.4473 -0.0009 0.0016 0.0017 8.0158 10.3240 26.7933 37.8273 47.0162
frequency: 26.4401 37.5656 46.9476 70.0269 81.2801 129.3459 143.3062 149.5670 169.1318 181.0910 218.3240 224.4114 233.0803 240.2426 252.3608 300.1411 307.5020 334.3924 336.6133 401.8236 411.5799 420.6378 456.9294 500.7341 518.9509 521.8462 547.1745 557.3825 630.7145 673.4641 731.9528 735.9385 759.8154 781.8508 792.9101 798.2256 830.6113 839.7687 883.4876 885.2535 903.2699 928.9527 945.1864 955.3311 961.7183 986.8526 996.4577 1010.0502 1037.4525 1041.5837 1067.9741 1095.1050 1106.8255 1128.8417 1169.9272 1179.9272 1207.5998 1226.2400 1240.0976 1260.8745 1272.8109 1290.8900 1293.5679 1323.9358 1333.0938 1350.9060 1393.5974 1394.3105 1404.1011 1421.8308 1463.3097 1464.9640 1472.6473 1478.7569 1484.3628 1490.6593 1501.8890 1561.1247 1605.2998 1630.5071 2966.5959 2973.9109 2976.8980 3001.7074 3015.2843 3044.3919 3070.6222 3073.6187 3083.2397 3127.9226 3129.5470 3143.9647 3152.5848 3164.4920 3191.3946 3473.1618
redmass: 6.6036 4.4461 5.2619 3.8118 1.6607 3.2142 3.2631 5.3661 2.6086 5.0406 3.3778 4.7617 1.1325 2.3833 5.1744 4.8120 5.1863 5.9895 3.2973 3.2608 3.5623 6.8784 4.1477 5.2900 5.4698 5.0437 3.8251 5.3037 6.4365 3.8907 4.4288 1.0842 1.3756 5.2751 1.9893 1.4539 6.0874 1.5740 2.7897 2.1432 1.9091 1.5170 6.5794 2.5203 1.8241 1.4138 1.3763 3.9991 1.3446 1.7976 2.6360 1.5807 2.1484 1.9989 1.2805 1.2698 1.5149 2.0677 1.7654 1.3086 1.4013 1.3522 1.2008 1.3205 1.8080 1.5155 1.2162 3.5540 4.6306 2.5698 2.3675 1.0744 1.0726 1.0440 1.0716 1.1051 3.0836 7.4102 6.0192 6.6486 1.0590 1.0386 1.0609 1.0668 1.0952 1.0995 1.1002 1.0996 1.0997 1.0873 1.0868 1.0908 1.0977 1.0980 1.0951 1.0660
irintensity: 0.0619 0.7974 0.1587 0.2217 0.1056 0.6930 1.0769 5.3096 17.1967 1.8556 6.9739 1.7614 0.0315 35.2584 1.7461 29.2331 24.0574 5.9765 3.8376 1.2511 8.6913 60.1902 7.5209 18.0204 0.0795 86.5418 4.5440 35.1795 4.8733 1.6736 0.2848 9.8223 46.1900 2.0291 12.8183 1.3866 35.1350 70.3727 3.0212 6.7108 7.1096 7.1571 58.8439 30.4956 22.0498 1.9284 0.3820 4.5971 44.7789 30.9975 6.2189 1.4172 33.0535 1.0297 0.9266 6.2808 3.1307 3.6457 5.2365 5.5822 5.5592 5.5420 7.6704 3.7466 1.5979 0.1654 12.7496 15.1229 1.5344 3.3188 3.3189 0.3113 2.5559 11.4020 2.3810 30.2617 17.9109 5.9577 8.6680 13.9371 22.9096 30.5131 43.6401 30.8020 5.0978 16.1014 54.1941 56.1654 21.5327 1.1133 3.2471 13.2857 20.8620 25.9389 6.9505 37.2437
temp: 298.150 k
press: 1.00000 atm
elementType: 16 8 8 8 6 6 6 6 6 6 6 6 6 6 6 6 6 6 1 1 1 1 1 1 1 1 1 1 1 1 1 1 1 1
symmnumber: 1
zpe: 698828.4 jmol-1
zpe.correction: 0.266170 hartree
zpe.thermalcorrener: 0.284443 hartree
zpe.thermalcorrenthalpy: 0.285388 hartree
zpe.thermalcorrgfe: 0.219103 hartree
zpe.sumelectzpe: -1165.328320 hartree
zpe.sumelectthermal: -1165.310046 hartree
zpe.sumelectthermalent: -1165.309102 hartree
zpe.sumelectthermalfe: -1165.375387 hartree
dipole: -1.4405 -3.9524 1.4633
dipole: 4.4540
quadrupole: -103.1398 -107.7990 -120.3861
quadrupole: 1.0129 -2.8682 11.0134
quadrupole: 7.3018 2.6426 -9.9445 1.0129 -2.8682 11.0134
hfenergy: -1165.5944895 hartree
pointgroup: C01 [X(C14H16O3S1)]
dipole: -0.5893261 -1.5324944 0.6122464 debye
polarizability: 267.8782268|-1.8240834|197.7379559|-18.4270642|6.8934366|115.6723287 unknown
InChI: InChI=1S/C14H16O3S/c1-2-3-6-12-10-9-11-7-4-5-8-13(11)14(12)18(15,16)17/h4-5,7-10,15H,2-3,6H2,1H3
charge 0 multiplicity 1
34 atoms
S  0.511028 1.982291 -0.434587
O  0.424932 2.239104 1.416006
O  2.061447 2.120932 -0.876188
O  -0.527905 3.012563 -1.131741
C  2.211937 -0.790631 -0.906642
C  0.71494 -0.868256 -0.651112
C  -0.163619 0.192607 -0.383464
C  3.02412 -0.748858 0.421159
C  -1.564218 0.052835 -0.063184
C  -2.088772 -1.304061 -0.053863
C  4.54272 -0.643478 0.162092
C  0.129774 -2.184385 -0.629932
C  -1.212504 -2.396111 -0.346569
C  -2.467049 1.123834 0.250777
C  -3.468902 -1.531757 0.254369
C  5.365751 -0.636021 1.467988
C  -3.806512 0.863602 0.550209
C  -4.320254 -0.468786 0.552024
H  2.512463 -1.689982 -1.476598
H  2.482996 0.09449 -1.504046
H  2.806973 -1.657789 1.018667
H  2.694831 0.118879 1.024109
H  4.868834 -1.488875 -0.478491
H  4.742793 0.283568 -0.410833
H  0.790509 -3.03064 -0.847461
H  -1.619793 -3.413716 -0.343267
H  -2.114152 2.156173 0.247301
H  -3.840785 -2.562908 0.253168
H  5.200849 -1.563157 2.049012
H  5.079743 0.218082 2.109899
H  6.44856 -0.554871 1.260662
H  -4.473563 1.69925 0.78718
H  -5.37426 -0.648715 0.787732
H  0.692388 3.189383 1.587225
